{"text_format":"1","workbook":"xlsx","n_sheets":4,"sheets":["Inch","Metric","Data","CustomerSheetBeta"],"not_rendered":{"charts":156,"images":20,"macros":1,"external_links":0,"defined_names":0,"comments":2,"pivot_tables":0},"unopened":[],"bounds":{"document_bytes":16777216,"sheet_cells":100000,"rows_first":2000,"rows_last":500,"rows_between":2000,"halvings":0,"cell_chars":16384,"cell_head_chars":4096},"cells_cut":0,"cells_raw":0,"read":"whole","date_system":"1900"}

{"sheet":"Inch","index":0,"n_rows":249,"n_cols":23,"rows_kept":249,"cut":false,"hidden":false,"merged":[[114,5,114,6],[92,5,92,6],[93,5,93,6],[94,5,94,6],[95,5,95,6],[96,5,96,6],[104,5,104,6],[105,5,105,6],[99,5,99,6],[106,5,106,6],[107,5,107,6],[108,5,108,6],[109,5,109,6],[110,5,110,6],[111,5,111,6],[90,5,90,6],[91,5,91,6],[97,5,97,6],[98,5,98,6],[100,5,100,6],[101,5,101,6],[102,5,102,6],[103,5,103,6],[113,5,113,6],[112,5,112,6],[81,5,81,6],[82,5,82,6],[83,5,83,6],[84,5,84,6],[85,5,85,6],[86,5,86,6],[87,5,87,6],[88,5,88,6],[89,5,89,6],[71,5,71,6],[72,5,72,6],[73,5,73,6],[74,5,74,6],[75,5,75,6],[76,5,76,6],[77,5,77,6],[78,5,78,6],[79,5,79,6],[115,5,115,6],[116,5,116,6],[56,1,56,12],[60,1,60,3],[58,1,58,2],[68,1,68,2],[2,5,2,8],[4,1,4,3],[13,1,13,3],[17,1,17,2],[27,1,27,3],[23,4,23,5],[24,4,24,5],[23,7,23,8],[24,7,24,8],[35,4,35,5],[36,4,36,5],[37,4,37,5],[38,4,38,5],[31,1,31,2],[41,1,41,3],[80,5,80,6],[69,1,70,2],[69,5,70,6],[34,10,34,11],[23,10,23,11],[24,10,24,11],[14,10,14,11],[14,7,14,8],[14,4,14,5],[20,10,20,11],[20,7,20,8],[20,4,20,5],[21,4,21,5],[22,4,22,5],[21,7,21,8],[22,7,22,8],[21,10,21,11],[22,10,22,11],[28,4,28,5],[34,4,34,5],[34,7,34,8],[45,1,45,2],[49,4,49,5],[50,4,50,5],[51,4,51,5],[52,4,52,5],[49,7,49,8],[50,7,50,8],[51,7,51,8],[52,7,52,8],[48,7,48,8],[48,4,48,5],[117,5,117,6],[115,22,115,23],[71,22,71,23],[72,22,72,23],[73,22,73,23],[5,4,5,5],[49,10,49,11],[50,10,50,11],[51,10,51,11],[52,10,52,11],[42,10,42,11],[42,7,42,8],[42,4,42,5],[48,10,48,11],[35,7,35,8],[36,7,36,8],[37,7,37,8],[38,7,38,8],[35,10,35,11],[36,10,36,11],[37,10,37,11],[38,10,38,11],[28,10,28,11],[28,7,28,8]]}
[]
[]
[null,null,null,null,null,"Flow Cell Selector"]
[null,null,null,null,null,null,null,null,null,null,null,null,"Ver1.8.2"]
[null,"Select Industry:",null,null,null,null,null,null,null,null,null,null,null,null,"EXAMPLE: Section view of GFC-K60-P40-SS-J15-P10 flowcell."]
[null,null,null,null,"Set Inch / Metric:"]
[null,null,null,"Insert values. Calculator shows three best suited flow cell options for the pipe size and flow rate"]
[]
[null,null,null,null,"Flow rate Q =",13,"GPM",null,"Pipe Size = ",1," Inch"]
[null,null,null,null,null,{"$f":"IF(F9>1500,\"Out of Range\",\" \")","v":" "}]
[null,null,"Recommended prism flow velocity is 6.1 ft/s or higher for a sugar solution. Other liquids recommended flow velocity depends on medium viscosity, purity and temperature."]
[null,null,"Recommended maximum flow in the flow cell is 20 ft/s for all flow cells. With velocities above this there is a risk for cavitation."]
[]
[null,"Chemical Industry"]
[null,null,null,null,{"$f":"ROUND(Inch!$C$137,1) & \" ft/s \"","v":"9.3 ft/s "},null,null,{"$f":"ROUND(Inch!$E$137,1) & \" ft/s \"","v":"2.2 ft/s "},null,null,{"$f":"ROUND(Inch!$G$137,1) & \" ft/s \"","v":"2 ft/s "},null,null,null,"Flow rate Q: Inlet flow. Use the flow calculator below to determine flow rate if not provided by the customer."]
[null,null,null,null,null,null,null,0.68110236220472442,null,null,null,null,null,null,"Pipe size: Installation site's pipe size. Flow cell selector has 7 options of standard pipe sizes, but the options might be limited by chosen industry."]
[null,null,null,null,null,null,null,1.3048539096049159,null,null,null,null,null,null,"Inlet size: \"True size\" of the pipe connection."]
[null,"Flow on prism",null,null,null,null,null,2.6,null,null,null,null,null,null,"Flow on prism: Flow velocity measured over the the prism. Always measured from the same surface area."]
[null,null,null,null,null,null,null,null,null,null,null,null,null,null,"Max flow in flowcell: Maximum measured flow velocity inside flowcell. Can occur anywhere in flowcell, depending on the model."]
[null,null,null,null,null,null,null,null,null,null,null,null,null,null,"Pressure drop: Measured drop of pressure when comparing inlet flow vs. outlet flow pressure."]
[null,null,null,null,{"$f":"Inch!$D$137","v":"GFC-K60-P40-SS-J15-P10"},null,null,{"$f":"Inch!$F$137","v":"PFC-KSS-A10"},null,null,{"$f":"Inch!$H$137","v":"GFC-K60-P40-SS-R10/N10/A10/D25-PXX-SN/WN/WP-PG"}]
[null,"Pipe size",null,null,{"$f":"INDEX(H$72:H$121,MATCH(D$137,B$72:B$121,0))","v":1},null,null,{"$f":"INDEX(H$72:H$121,MATCH(F$137,B$72:B$121,0))","v":1},null,null,{"$f":"INDEX(H$72:H$121,MATCH(H$137,B$72:B$121,0))","v":1},null,"in"]
[null,"Inlet diameter",null,null,{"$f":"INDEX(I$72:I$121,MATCH(D$137,B$72:B$121,0))","v":0.37007874015748032},null,null,{"$f":"INDEX(I$72:I$121,MATCH(F$137,B$72:B$121,0))","v":1.0606299212598427},null,null,{"$f":"INDEX(I$72:I$121,MATCH(H$137,B$72:B$121,0))","v":0.88031496062992132},null,"in"]
[null,"Pressure drop",null,null,{"$f":"INDEX(K$72:K$121,MATCH(D$137,B$72:B$121,0))","v":3.478566497511614},null,null,{"$f":"INDEX(K$72:K$121,MATCH(F$137,B$72:B$121,0))","v":5.4065403729527027E-2},null,null,{"$f":"INDEX(K$72:K$121,MATCH(H$137,B$72:B$121,0))","v":0.1780144606400911},null,"psi"]
[null,"Flow on prism",null,null,{"$f":"ROUND(Inch!$C$137,1)","v":9.3000000000000007},null,null,{"$f":"ROUND(Inch!$E$137,1)","v":2.2000000000000002},null,null,{"$f":"ROUND(Inch!$G$137,1)","v":2},null,"ft/s"]
[]
[]
[null,"Food Industry"]
[null,null,null,null,{"$f":"ROUND(Inch!$C$138,1) & \" ft/s \"","v":"1.8 ft/s "},null,null,{"$f":"ROUND(Inch!$E$138,1) & \" ft/s \"","v":"1.4 ft/s "},null,null,{"$f":"ROUND(Inch!$G$138,1) & \" ft/s \"","v":"1.2 ft/s "},null,null,null,"Flow rate Q: Inlet flow. Use the flow calculator below to determine flow rate if not provided by the customer."]
[null,null,null,null,null,null,null,null,null,null,null,null,null,null,"Pipe size: Installation site's pipe size. Flow cell selector has 7 options of standard pipe sizes, but the options might be limited by chosen industry."]
[null,null,null,null,null,null,null,null,null,null,null,null,null,null,"Inlet size: \"True size\" of the pipe connection."]
[null,"Flow on prism",null,null,null,null,null,null,null,null,null,null,null,null,"Flow on prism: Flow velocity measured over the the prism. Always measured from the same surface area."]
[null,null,null,null,null,null,null,null,null,null,null,null,null,null,"Max flow in flowcell: Maximum measured flow velocity inside flowcell. Can occur anywhere in flowcell, depending on the model."]
[null,null,null,null,null,null,null,null,null,null,null,null,null,null,"Pressure drop: Measured drop of pressure when comparing inlet flow vs. outlet flow pressure."]
[null,null,null,null,{"$f":"Inch!$D$138","v":"AFC-HSS-H10-RI (-NC-SN/WNWP-PG) "},null,null,{"$f":"Inch!$F$138","v":"AFC-HSS-H10-SI (-NC-SN/WNWP-PG)"},null,null,{"$f":"Inch!$H$138","v":"AFC-HSS-H15-RI (-NC-SN/WNWP-PG) "}]
[null,"Pipe size",null,null,{"$f":"INDEX(H$72:H$121,MATCH(D$138,B$72:B$121,0))","v":1},null,null,{"$f":"INDEX(H$72:H$121,MATCH(F$138,B$72:B$121,0))","v":1},null,null,{"$f":"INDEX(H$72:H$121,MATCH(H$138,B$72:B$121,0))","v":1.5},null,"in"]
[null,"Inlet diameter",null,null,{"$f":"INDEX(I$72:I$121,MATCH(D$138,B$72:B$121,0))","v":0.88976377952755914},null,null,{"$f":"INDEX(I$72:I$121,MATCH(F$138,B$72:B$121,0))","v":0.88976377952755914},null,null,{"$f":"INDEX(I$72:I$121,MATCH(H$138,B$72:B$121,0))","v":1.4015748031496065},null,"in"]
[null,"Pressure drop",null,null,{"$f":"INDEX(K$72:K$121,MATCH(D$138,B$72:B$121,0))","v":6.4273673504153722E-2},null,null,{"$f":"INDEX(K$72:K$121,MATCH(F$138,B$72:B$121,0))","v":2.7039696493339566E-2},null,null,{"$f":"INDEX(K$72:K$121,MATCH(H$138,B$72:B$121,0))","v":1.6282870313655141E-2},null,"psi"]
[null,"Flow on prism",null,null,{"$f":"ROUND(Inch!$C$138,2)","v":1.79},null,null,{"$f":"ROUND(Inch!$E$138,2)","v":1.43},null,null,{"$f":"ROUND(Inch!$G$138,2)","v":1.2},null,"ft/s"]
[]
[]
[null,"Semiconductor"]
[null,null,null,null,{"$f":"ROUND(Inch!$C$139,1) & \" ft/s \"","v":"3.1 ft/s "},null,null,{"$f":"ROUND(Inch!$E$139,1) & \" ft/s \"","v":"2.4 ft/s "},null,null,{"$f":"ROUND(Inch!$G$139,1) & \" ft/s \"","v":"9000 ft/s "},null,null,null,"Flow rate Q: Inlet flow. Use the flow calculator below to determine flow rate if not provided by the customer."]
[null,null,null,null,null,null,null,null,null,null,null,null,null,null,"Pipe size: Installation site's pipe size. Flow cell selector has 7 options of standard pipe sizes, but the options might be limited by chosen industry."]
[null,null,null,null,null,null,null,null,null,null,null,null,null,null,"Inlet size: \"True size\" of the pipe connection."]
[null,"Flow on prism",null,null,null,null,null,null,null,null,null,null,null,null,"Flow on prism: Flow velocity measured over the the prism. Always measured from the same surface area."]
[null,null,null,null,null,null,null,null,null,null,null,null,null,null,"Max flow in flowcell: Maximum measured flow velocity inside flowcell. Can occur anywhere in flowcell, depending on the model."]
[null,null,null,null,null,null,null,null,null,null,null,null,null,null,"Pressure drop: Measured drop of pressure when comparing inlet flow vs. outlet flow pressure."]
[null,null,null,null,{"$f":"Inch!$D$139","v":"PR-33-S (1\") F2-100"},null,null,{"$f":"Inch!$F$139","v":"PR-33-S (3/4\") F2-075"},null,null,{"$f":"Inch!$H$139","v":"Out of range"}]
[null,"Pipe size           ",null,null,{"$f":"INDEX(H$72:H$121,MATCH(D139,B$72:B$121,0))","v":1},null,null,{"$f":"INDEX(H$72:H$121,MATCH(F139,B$72:B$121,0))","v":0.75000000000000011},null,null,{"$f":"INDEX(H$72:H$121,MATCH(H139,B$72:B$121,0))","v":0},null,"in"]
[null,"Inlet diameter",null,null,{"$f":"INDEX(I$72:I$121,MATCH(D139,B$72:B$121,0))","v":0.86614173228346458},null,null,{"$f":"INDEX(I$72:I$121,MATCH(F139,B$72:B$121,0))","v":0.62992125984251968},null,null,{"$f":"INDEX(I$72:I$121,MATCH(H139,B$72:B$121,0))","v":0},null,"in"]
[null,"Pressure drop",null,null,{"$f":"INDEX(K$72:K$121,MATCH(D139,B$72:B$121,0))","v":1.0687951528265289},null,null,{"$f":"INDEX(K$72:K$121,MATCH(F139,B$72:B$121,0))","v":0.80306493658857425},null,null,{"$f":"INDEX(K$72:K$121,MATCH(H139,B$72:B$121,0))","v":0},null,"psi"]
[null,"Flow on prism",null,null,{"$f":"ROUND(Inch!$C$139,1)","v":3.1},null,null,{"$f":"ROUND(Inch!$E$139,1)","v":2.4},null,null,{"$f":"ROUND(Inch!$G$139,1)","v":9000},null,"ft/s"]
[]
[]
[]
[null,"Disclaimer: The values represented here should be only considered as a rule of thumb. They are only estimates with water at 20 °C (68 °F). In real life applications the applicable flow rates can differ by features of chosen liquid (concentration, viscosity etc.). For example, black liquor rarely can exceed 0.5 m/s (1.6 ft/s) velocities due to high viscosity, and high velocities with high concentration sulphuric acid can increase corrosion. Moreover, individual conditions of the installation site can affect the flow cell selection (proximity to other equipment and/or pipe bends, temperature)"]
[]
[null,"Flow Calculator:"]
[]
[null,"Flow Calculator"]
[]
[null,null,"Flow cell inlet diameter ",null,null,1,"inch","Flow cell inlet diameter ",null,null,22.6,"mm"]
[null,null,"Flow rate Q",null,null,13.2,"GPM","Velocity v",null,null,1.6,"m/s"]
[null,null,"Velocity v",null,null,{"$f":"0.003785411784*F64/((0.001*0.5*25.4*F63)^2*PI()*60)","v":1.6435332550514008},"m/s","Flow rate Q",null,null,{"$f":"K66*0.264172052358","v":10.173370541269207},"GPM"]
[null,null,"Velocity v",null,null,{"$f":"F65*3.28083989501","v":5.3921694719482813},"ft/s","Flow rate Q",null,null,{"$f":"K67*1000/60","v":38.510396729940553},"l/min"]
[null,null,null,null,null,null,null,"Flow rate Q",null,null,{"$f":"(K64*9*PI()*(K63)^2)/10000","v":2.3106238037964331},"m3/h"]
[]
[null,"List All Flow Cells:"]
[null,"Model",null,null,null,"PR-Model",null,"Pipe size","Inlet diameter"," Flow on prism","Pressure loss ","Max velocity within flowcell"]
[null,null,null,null,null,null,null,"in","in","ft/s","psi","ft/s"]
[null,"PMFC-HSS-H04",null,null,null,"PR-23-A/PR-43-A",null,{"$f":"12.7/25.4","v":0.5},{"$f":"4/25.4","v":0.15748031496062992},{"$f":"IF(Data!M90<0,0,Data!M90)","v":256.43130268296358},{"$f":"IF(Data!P90<0,0,Data!P90)","v":75.604547178297423},{"$f":"IF(Data!S90<0,0,Data!S90)","v":126.65562537873041},{"$f":"IF(L72<0,0,J72)","v":256.43130268296358},{"$f":"IF(L72>20,\"Max velocity over 20 ft/s, risk of cavitation\", \" \")","v":"Max velocity over 20 ft/s, risk of cavitation"},null,null,{"$f":"B124","v":2.4},"0 - 2.5 ft/s"]
[null,"PMFC-HSS-H05",null,null,null,"PR-23-A/PR-43-A",null,{"$f":"12.7/25.4","v":0.5},{"$f":"5/25.4","v":0.19685039370078741},{"$f":"IF(Data!M95<0,0,Data!M95)","v":37.766973708955163},{"$f":"IF(Data!P95<0,0,Data!P95)","v":22.278293919582978},{"$f":"IF(Data!S95<0,0,Data!S95)","v":71.854909039390847},{"$f":"IF(L73<0,0,J73)","v":37.766973708955163},{"$f":"IF(L73>20,\"Max velocity over 20 ft/s, risk of cavitation\", \" \")","v":"Max velocity over 20 ft/s, risk of cavitation"},null,null,{"$f":"B125","v":4},"2.5 - 5 ft/s"]
[null,"PMFC-HSS-H06",null,null,null,"PR-23-A/PR-43-A",null,{"$f":"12.7/25.4","v":0.5},{"$f":"6/25.4","v":0.23622047244094491},{"$f":"IF(Data!M100<0,0,Data!M100)","v":29.089240668810227},{"$f":"IF(Data!P100<0,0,Data!P100)","v":7.6078772234023226},{"$f":"IF(Data!S100<0,0,Data!S100)","v":54.008603466663416},29.089240668810227,"Max velocity over 20 ft/s, risk of cavitation",null,null,{"$f":"B126","v":16.399999999999999},"5 - 16.5 ft/s"]
[null,"AFC-HSS-H10-SI (-NC-SN/WNWP-PG)",null,null,null,"PR-23-A/PR-43-A",null,{"$f":"25.4/25.4","v":1},{"$f":"22.6/25.4","v":0.88976377952755914},{"$f":"IF(Data!M10<0,0,Data!M10)","v":1.433202176399565},{"$f":"IF(Data!P10<0,0,Data!P10)","v":2.7039696493339566E-2},{"$f":"IF(Data!S10<0,0,Data!S10)","v":3.2598907916456703},1.433202176399565," ",null,null,{"$f":"B127","v":18},"16.5 - 20 ft/s"]
[null,"AFC-HSS-H10-RI (-NC-SN/WNWP-PG) ",null,null,null,"PR-23-A/PR-43-A",null,1,{"$f":"22.6/25.4","v":0.88976377952755914},{"$f":"IF(Data!M5<0,0,Data!M5)","v":1.7916503515435847},{"$f":"IF(Data!P5<0,0,Data!P5)","v":6.4273673504153722E-2},{"$f":"IF(Data!S5<0,0,Data!S5)","v":4.8521163056775247},1.7916503515435847," ",null,null,{"$f":"B128","v":21},"over 20 ft/s"]
[null,"AFC-HSS-H15-SI (-NC-SN/WNWP-PG)",null,null,null,"PR-23-A/PR-43-A",null,1.5,{"$f":"35.6/25.4","v":1.4015748031496065},{"$f":"IF(Data!M20<0,0,Data!M20)","v":0.79055799052362086},{"$f":"IF(Data!P20<0,0,Data!P20)","v":3.7684608615807164E-3},{"$f":"IF(Data!S20<0,0,Data!S20)","v":1.3866082111716274},0.79055799052362086," "]
[null,"AFC-HSS-H15-RI (-NC-SN/WNWP-PG) ",null,null,null,"PR-23-A/PR-43-A",null,1.5,{"$f":"35.6/25.4","v":1.4015748031496065},{"$f":"IF(Data!M15<0,0,Data!M15)","v":1.1962760783030677},{"$f":"IF(Data!P15<0,0,Data!P15)","v":1.6282870313655141E-2},{"$f":"IF(Data!S15<0,0,Data!S15)","v":2.3220404745413163},1.1962760783030677," "]
[null,"AFC-HSS-H20-SI (-NC-SN/WNWP-PG) ",null,null,null,"PR-23-A/PR-43-A",null,{"$f":"50.8/25.4","v":2},{"$f":"48.6/25.4","v":1.9133858267716537},{"$f":"IF(Data!M30<0,0,Data!M30)","v":0.29467156408050388},{"$f":"IF(Data!P30<0,0,Data!P30)","v":1.1670590958759684E-3},{"$f":"IF(Data!S30<0,0,Data!S30)","v":1.1077024524535979},0.29467156408050388," "]
[null,"AFC-HSS-H20-RI (-NC-SN/WNWP-PG)",null,null,null,"PR-23-A/PR-43-A",null,{"$f":"50.8/25.4","v":2},{"$f":"48.6/25.4","v":1.9133858267716537},{"$f":"IF(Data!M25<0,0,Data!M25)","v":0.58290081893414392},{"$f":"IF(Data!P25<0,0,Data!P25)","v":3.6643452834300124E-3},{"$f":"IF(Data!S25<0,0,Data!S25)","v":1.1621236008653184},0.58290081893414392," "]
[null,"AFC-HSS-H25-SI (-NC-SN/WNWP-PG) ",null,null,null,"PR-23-A/PR-43-A",null,{"$f":"63.5/25.4","v":2.5},{"$f":"60.3/25.4","v":2.3740157480314963},{"$f":"IF(Data!M35<0,0,Data!M35)","v":0.18217670845458006},{"$f":"IF(Data!P35<0,0,Data!P35)","v":3.5011772876279051E-4},{"$f":"IF(Data!S35<0,0,Data!S35)","v":0.60259619914660212},0.18217670845458006," "]
[null,"AFC-HSS-H30-SI (-NC-SN/WNWP-PG)",null,null,null,"PR-23-A/PR-43-A",null,{"$f":"76.2/25.4","v":3.0000000000000004},{"$f":"72.8/25.4","v":2.8661417322834648},{"$f":"IF(Data!M40<0,0,Data!M40)","v":0.14766591600881374},{"$f":"IF(Data!P40<0,0,Data!P40)","v":8.5206327879972098E-5},{"$f":"IF(Data!S40<0,0,Data!S40)","v":0.24063860192946962},0.14766591600881374," "]
[null,"AFC-HSS-H40-SI (-NC-SN/WNWP-PG)",null,null,null,"PR-23-A/PR-43-A",null,{"$f":"101.6/25.4","v":4},{"$f":"97.6/25.4","v":3.8425196850393699},{"$f":"IF(Data!M45<0,0,Data!M45)","v":7.2947171739635802E-2},{"$f":"IF(Data!P45<0,0,Data!P45)","v":3.6500584886653398E-5},{"$f":"IF(Data!S45<0,0,Data!S45)","v":0.13227741553914402},7.2947171739635802E-2," "]
[null,"SFC-HHSS-H10-90",null,null,null,"PR-23-A/PR-43-A",null,1,{"$f":"22.6/25.4","v":0.88976377952755914},{"$f":"IF(Data!M50<0,0,Data!M50)","v":0.4151384960893672},{"$f":"IF(Data!P50<0,0,Data!P50)","v":3.0568852295271676E-2},{"$f":"IF(Data!S50<0,0,Data!S50)","v":2.7107172967447686},{"$f":"IF(L84<0,0,J84)","v":0.4151384960893672},{"$f":"IF(L84>20,\"Max velocity over 20 ft/s, risk of cavitation\", \" \")","v":" "}]
[null,"SFC-HHSS-H10-180",null,null,null,"PR-23-A/PR-43-A",null,1,{"$f":"22.6/25.4","v":0.88976377952755914},{"$f":"IF(Data!M55<0,0,Data!M55)","v":0.26544061734305907},{"$f":"IF(Data!P55<0,0,Data!P55)","v":2.0669833866054102E-2},{"$f":"IF(Data!S55<0,0,Data!S55)","v":2.6840108439869783},0.26544061734305907," "]
[null,"SFC-HHSS-H15-90",null,null,null,"PR-23-A/PR-43-A",null,1.5,{"$f":"35.6/25.4","v":1.4015748031496065},{"$f":"IF(Data!M60<0,0,Data!M60)","v":0.26780271404911526},{"$f":"IF(Data!P60<0,0,Data!P60)","v":0},{"$f":"IF(Data!S60<0,0,Data!S60)","v":1.0611579559385702},0.26780271404911526," "]
[null,"SFC-HHSS-H15-180",null,null,null,"PR-23-A/PR-43-A",null,1.5,{"$f":"35.6/25.4","v":1.4015748031496065},{"$f":"IF(Data!M65<0,0,Data!M65)","v":0.1446784232459388},{"$f":"IF(Data!P65<0,0,Data!P65)","v":2.5268123963797457E-3},{"$f":"IF(Data!S65<0,0,Data!S65)","v":1.0664866627843488},0.1446784232459388," "]
[null,"SFC-HHSS-H20-90",null,null,null,"PR-23-A/PR-43-A",null,{"$f":"50.8/25.4","v":2},{"$f":"48.6/25.4","v":1.9133858267716537},{"$f":"IF(Data!M70<0,0,Data!M70)","v":0.22509662468142877},{"$f":"IF(Data!P70<0,0,Data!P70)","v":1.6254891799350937E-3},{"$f":"IF(Data!S70<0,0,Data!S70)","v":0.79924074992577621},0.22509662468142877," "]
[null,"SFC-HHSS-H20-180",null,null,null,"PR-23-A/PR-43-A",null,{"$f":"50.8/25.4","v":2},{"$f":"48.6/25.4","v":1.9133858267716537},{"$f":"IF(Data!M75<0,0,Data!M75)","v":8.7692840212334325E-2},{"$f":"IF(Data!P75<0,0,Data!P75)","v":0},{"$f":"IF(Data!S75<0,0,Data!S75)","v":0.59052417651403588},8.7692840212334325E-2," "]
[null,"SFC-HHSS-H25-90",null,null,null,"PR-23-A/PR-43-A",null,{"$f":"63.5/25.4","v":2.5},{"$f":"60.3/25.4","v":2.3740157480314963},{"$f":"IF(Data!M80<0,0,Data!M80)","v":9.4275785854750604E-2},{"$f":"IF(Data!P80<0,0,Data!P80)","v":4.6402578691996665E-4},{"$f":"IF(Data!S80<0,0,Data!S80)","v":0.49489413179906677},9.4275785854750604E-2," "]
[null,"SFC-HHSS-H25-180",null,null,null,"PR-23-A/PR-43-A",null,{"$f":"63.5/25.4","v":2.5},{"$f":"60.3/25.4","v":2.3740157480314963},{"$f":"IF(Data!M85<0,0,Data!M85)","v":0.16247261027204557},{"$f":"IF(Data!P85<0,0,Data!P85)","v":1.5664367622836902E-4},{"$f":"IF(Data!S85<0,0,Data!S85)","v":0.36878234823301537},0.16247261027204557," "]
[null,"PR-33-S (1/4\") F2-025\n",null,null,null,"PR-33-S/PR-23-MS",null,{"$f":"6.35/25.4","v":0.25},{"$f":"4/25.4","v":0.15748031496062992},{"$f":"IF(Data!M105<0,0,Data!M105)","v":36.230506524630727},{"$f":"IF(Data!P105<0,0,Data!P105)","v":56.931324909355446},{"$f":"IF(Data!S105<0,0,Data!S105)","v":98.879068516677961},{"$f":"IF(L92<0,0,J92)","v":36.230506524630727},"Max velocity over 20 ft/s, risk of cavitation"]
[null,"PR-33-S (3/8\") F2-038",null,null,null,"PR-33-S/PR-23-MS",null,{"$f":"9.5/25.4","v":0.37401574803149606},{"$f":"6.5/25.4","v":0.25590551181102361},{"$f":"IF(Data!M125<0,0,Data!M125)","v":18.366187675851286},{"$f":"IF(Data!P125<0,0,Data!P125)","v":10.067258549666839},{"$f":"IF(Data!S125<0,0,Data!S125)","v":44.522445272584839},{"$f":"IF(L93<0,0,J93)","v":18.366187675851286},"Max velocity over 20 ft/s, risk of cavitation"]
[null,"PR-33-S (1/2\") F2-050",null,null,null,"PR-33-S/PR-23-MS",null,{"$f":"12.7/25.4","v":0.5},{"$f":"11/25.4","v":0.43307086614173229},{"$f":"IF(Data!M110<0,0,Data!M110)","v":6.2602072153180899},{"$f":"IF(Data!P110<0,0,Data!P110)","v":3.6039513847800699},{"$f":"IF(Data!S110<0,0,Data!S110)","v":30.162558445923874},{"$f":"IF(L94<0,0,J94)","v":6.2602072153180899},"Max velocity over 20 ft/s, risk of cavitation"]
[null,"PR-33-S (3/4\") F2-075",null,null,null,"PR-33-S/PR-23-MS",null,{"$f":"19.05/25.4","v":0.75000000000000011},{"$f":"16/25.4","v":0.62992125984251968},{"$f":"IF(Data!M115<0,0,Data!M115)","v":2.3897034112758813},{"$f":"IF(Data!P115<0,0,Data!P115)","v":0.80306493658857425},{"$f":"IF(Data!S115<0,0,Data!S115)","v":15.855189878641916},2.3897034112758813," "]
[null,"PR-33-S (1\") F2-100",null,null,null,"PR-33-S/PR-23-MS",null,1,{"$f":"22/25.4","v":0.86614173228346458},{"$f":"IF(Data!M120<0,0,Data!M120)","v":3.0563028186959746},{"$f":"IF(Data!P120<0,0,Data!P120)","v":1.0687951528265289},{"$f":"IF(Data!S120<0,0,Data!S120)","v":16.993723466337105},3.0563028186959746," "]
[null,"WFC-KSS-A/D/J-05-NC-SN/WNWP/PG",null,null,null,"PR-23-GC",null,0.5,{"$f":"8.65*2/25.4","v":0.68110236220472442},{"$f":"IF(Data!M130<0,0,Data!M130)","v":3.3275757561422878},{"$f":"IF(Data!P130<0,0,Data!P130)","v":0.21749862029974459},{"$f":"IF(Data!S130<0,0,Data!S130)","v":8.2343590036068797},3.3275757561422878," "]
[null,"WFC-KSS-A/D/J-10-NC-SN/WNWP/PG",null,null,null,"PR-23-GC",null,1,{"$f":"2*13.35/25.4","v":1.0511811023622049},{"$f":"IF(Data!M135<0,0,Data!M135)","v":1.473175960059542},{"$f":"IF(Data!P135<0,0,Data!P135)","v":7.5297783257790948E-2},{"$f":"IF(Data!S135<0,0,Data!S135)","v":4.3821400213391399},1.473175960059542," "]
[null,"WFC-KSS-A/D/J-15-NC-SN/WNWP/PG",null,null,null,"PR-23-GC",null,1.5,{"$f":"40.9/25.4","v":1.610236220472441},{"$f":"IF(Data!M140<0,0,Data!M140)","v":0.52702309380995771},{"$f":"IF(Data!P140<0,0,Data!P140)","v":1.5706335394293211E-2},{"$f":"IF(Data!S140<0,0,Data!S140)","v":2.1884546196467127},0.52702309380995771," "]
[null,"GFC-K60-P40-SS-J15-P10",null,null,null,"PR-43-GC",null,1,{"$f":"4.7*2/25.4","v":0.37007874015748032},{"$f":"IF(Data!M145<0,0,Data!M145)","v":9.2501275581206563},{"$f":"IF(Data!P145<0,0,Data!P145)","v":3.478566497511614},{"$f":"IF(Data!S145<0,0,Data!S145)","v":17.508567686586055},9.2501275581206563," "]
[null,"GFC-K60-P40-SS-R05/N05/A05/D15-PXX-SN/WN/WP-PG",null,null,null,"PR-43-GC",null,0.5,{"$f":"2*5.97/25.4","v":0.4700787401574803},{"$f":"IF(Data!M150<0,0,Data!M150)","v":8.6790448486605261},{"$f":"IF(Data!P150<0,0,Data!P150)","v":2.6724510152404046},{"$f":"IF(Data!S150<0,0,Data!S150)","v":18.459972968859404},8.6790448486605261," "]
[null,"GFC-K60-P40-SS-R10/N10/A10/D25-PXX-SN/WN/WP-PG",null,null,null,"PR-43-GC",null,1,{"$f":"2*11.18/25.4","v":0.88031496062992132},{"$f":"IF(Data!M155<0,0,Data!M155)","v":1.98313109118668},{"$f":"IF(Data!P155<0,0,Data!P155)","v":0.1780144606400911},{"$f":"IF(Data!S155<0,0,Data!S155)","v":6.0506071496748133},1.98313109118668," "]
[null,"GFC-K60-P40-SS-D15-P40",null,null,null,"PR-43-GC",null,null,null,{"$f":"IF(Data!M160<0,0,Data!M160)","v":10.827277741018126},{"$f":"IF(Data!P160<0,0,Data!P160)","v":4.1291803595121515},{"$f":"IF(Data!S160<0,0,Data!S160)","v":18.977913565562044},10.827277741018126," "]
[null,"GFC-K60-P40-SS-D25-P40",null,null,null,"PR-43-GC",null,2.5,{"$f":"2*7.5/25.4","v":0.59055118110236227},{"$f":"IF(Data!M165<0,0,Data!M165)","v":1.9131724285911071},{"$f":"IF(Data!P165<0,0,Data!P165)","v":0.32240952330227562},{"$f":"IF(Data!S165<0,0,Data!S165)","v":8.9588857373539579},{"$f":"IF(L104<0,0,J104)","v":1.9131724285911071}," "]
[null,"PFC-KSS-A10",null,null,null,"PR-23-GC",null,1,{"$f":"2*13.47/25.4","v":1.0606299212598427},{"$f":"IF(Data!M170<0,0,Data!M170)","v":2.2137632236939035},{"$f":"IF(Data!P170<0,0,Data!P170)","v":5.4065403729527027E-2},{"$f":"IF(Data!S170<0,0,Data!S170)","v":3.714499458137539},2.2137632236939035," "]
[null,"PFC-23GP-A/D/J-SS-A10/D10/J10",null,null,null,"PR-23-GP",null,1,{"$f":"2*26.3/25.4","v":2.0708661417322838},{"$f":"IF(Data!M175<0,0,Data!M175)","v":0.31268255146418195},{"$f":"IF(Data!P175<0,0,Data!P175)","v":6.9883653181037058E-4},{"$f":"IF(Data!S175<0,0,Data!S175)","v":0.54062488359859984},0.31268255146418195," "]
[null,"PFC-23GP-A/D/J-SS-A15/D15/J15",null,null,null,"PR-23-GP",null,{"$f":"1.5","v":1.5},{"$f":"50/25.4","v":1.9685039370078741},{"$f":"IF(Data!M180<0,0,Data!M180)","v":0.32596934543574779},{"$f":"IF(Data!P180<0,0,Data!P180)","v":8.169413671131777E-4},{"$f":"IF(Data!S180<0,0,Data!S180)","v":0.55077070802891959},0.32596934543574779," "]
[null,"SVB-A020/D050-GC-PFA/ETF",null,null,null,"PR-23-W2",null,2,{"$f":"46/25.4","v":1.8110236220472442},{"$f":"IF(Data!M185<0,0,Data!M185)","v":4.2517740709010578E-2},{"$f":"IF(Data!P185<0,0,Data!P185)","v":5.9052417651403585E-4},{"$f":"IF(Data!S185<0,0,Data!S185)","v":1.2327192184730498},4.2517740709010578E-2," "]
[null,"SVB-A030/D050-GC-PFA/ETF",null,null,null,"PR-23-W3",null,{"$f":"76.2/25.4","v":3.0000000000000004},{"$f":"70/25.4","v":2.7559055118110236},{"$f":"IF(Data!M190<0,0,Data!M190)","v":1.9192035736706164E-2},{"$f":"IF(Data!P190<0,0,Data!P190)","v":5.9052417651403585E-4},{"$f":"IF(Data!S190<0,0,Data!S190)","v":0.68677961728582371},1.9192035736706164E-2," "]
[null,"SVB-A040/D050-GC-PFA/ETF",null,null,null,"PR-23-W4",null,{"$f":"101.6/25.4","v":4},{"$f":"90/25.4","v":3.5433070866141736},{"$f":"IF(Data!M195<0,0,Data!M195)","v":1.0038911000738608E-2},{"$f":"IF(Data!P195<0,0,Data!P195)","v":8.8578626477105372E-5},{"$f":"IF(Data!S195<0,0,Data!S195)","v":0.34516138117245398},1.0038911000738608E-2," "]
[null,"FTC-SS-A05/D10/J10",null,null,null,"PR-43-GP",null,0.5,{"$f":"26.7/25.4","v":1.0511811023622049},{"$f":"IF(Data!M200<0,0,Data!M200)","v":1.1659899865269636},{"$f":"IF(Data!P200<0,0,Data!P200)","v":8.8578626477105367E-4},{"$f":"IF(Data!S200<0,0,Data!S200)","v":1.9466629478785191},1.1659899865269636," "]
[null,"FTC-SS-A10/D10/J10",null,null,null,"PR-43-GP",null,1,{"$f":"2*12.4/25.4","v":0.97637795275590555},{"$f":"IF(Data!M205<0,0,Data!M205)","v":1.1913825261170674},{"$f":"IF(Data!P205<0,0,Data!P205)","v":2.0668346177991253E-3},{"$f":"IF(Data!S205<0,0,Data!S205)","v":2.2407439877825088},1.1913825261170674," "]
[null,"FTC-SS-A15/D15/J15",null,null,null,"PR-43-GP",null,1.5,{"$f":"40.9/25.4","v":1.610236220472441},{"$f":"IF(Data!M210<0,0,Data!M210)","v":0.47773405879985498},{"$f":"IF(Data!P210<0,0,Data!P210)","v":2.9526208825701792E-4},{"$f":"IF(Data!S210<0,0,Data!S210)","v":0.83382013723781856},0.47773405879985498," "]
[null,"FTC-SS-A20/D20/J20",null,null,null,"PR-43-GP",null,2,{"$f":"2*26.3/25.4","v":2.0708661417322838},{"$f":"IF(Data!M215<0,0,Data!M215)","v":0.26986954866691437},{"$f":"IF(Data!P215<0,0,Data!P215)","v":1.7715725295421074E-4},{"$f":"IF(Data!S215<0,0,Data!S215)","v":0.46444726482828919},0.26986954866691437," "]
[null,"CFC-RP-M20-M10-NC-PG/SN/WP",null,null,null,"PR-23-RP",null,1,{"$f":"26.7/25.4","v":1.0511811023622049},{"$f":"IF(Data!M220<0,0,Data!M220)","v":1.3747402829246755},{"$f":"IF(Data!P220<0,0,Data!P220)","v":4.3729742952468556E-3},{"$f":"IF(Data!S220<0,0,Data!S220)","v":1.7804303921898179},1.3747402829246755," "]
[null,"CFC-RP-M20-M20-NC-PG/SN/WP",null,null,null,"PR-23-RP",null,2,{"$f":"2*26.3/25.4","v":2.0708661417322838},{"$f":"IF(Data!M225<0,0,Data!M225)","v":0.4547036159158076},{"$f":"IF(Data!P225<0,0,Data!P225)","v":1.4763104412850896E-4},{"$f":"IF(Data!S225<0,0,Data!S225)","v":0.5550927259231937},0.4547036159158076," "]
[null,null,null,null,null,null,null,null,null,null,null,null,null,{"$f":"IF(L117>20,\"Warning! Max velocity over 20 ft/s!\", \" \")","v":" "}]
[null,null,null,null,null,null,null,null,null,null,null,null,null," "]
[]
[null,"Out of range",null,null,null,null,null,null,null,0]
[null,"Out of range",null,null,null,null,null,0,0,9000,0,0]
[]
[]
[null,2.4,null,null,null,null,null,null,null,null,null,null,"A-P:n teoria:",null,"Putkikoon muuttaminen tuumiin"]
[null,4,null,null,null,null,null,null,null,null,null,12.7,0.5,null,{"$f":"J9","v":1}]
[null,16.399999999999999,null,null,null,null,null,null,null,null,null,25.4,1]
[null,18,null,null,null,null,null,null,null,null,null,38.1,1.5]
[null,21,null,null,null,null,null,null,null,null,null,50.8,2]
[null,null,null,null,null,null,null,null,null,null,null,63.5,2.5]
[null,null,null,null,null,null,null,null,null,null,null,76.2,3]
[null,"recommended velocity",null,{"$f":"1.85*3.2808399","v":6.0695538150000008},null,"velocity",{"$f":"IF(F10=\"Out of range\",0,F9/4.402868)","v":2.9526208825701792},null,null,null,null,101.6,4]
[]
[]
[null,null,null,null,null,null,null,null,null,null,null,null,{"$f":"INDEX(M125:M131,MATCH(MIN(ABS(M125:M131-O125)),ABS(M125:M131-O125),0))","v":1}]
[]
[null,"Uusi käytännöllinen tuotteen valinta"]
[null,"Chemical industry",9.2501275581206563,{"$f":"INDEX(B$72:B$121,MATCH(C$137,J$72:J$121,0))","v":"GFC-K60-P40-SS-J15-P10"},2.2137632236939035,{"$f":"INDEX(B$72:B$121,MATCH(E$137,J$72:J$121,0))","v":"PFC-KSS-A10"},1.98313109118668,{"$f":"INDEX(B$72:B$121,MATCH(G$137,J$72:J$121,0))","v":"GFC-K60-P40-SS-R10/N10/A10/D25-PXX-SN/WN/WP-PG"}]
[null,"Food Industry",1.7916503515435847,{"$f":"INDEX(B$72:B$121,MATCH(C$138,J$72:J$121,0))","v":"AFC-HSS-H10-RI (-NC-SN/WNWP-PG) "},1.433202176399565,{"$f":"INDEX(B$72:B$121,MATCH(E$138,J$72:J$121,0))","v":"AFC-HSS-H10-SI (-NC-SN/WNWP-PG)"},1.1962760783030677,{"$f":"INDEX(B$72:B$121,MATCH(G$138,J$72:J$121,0))","v":"AFC-HSS-H15-RI (-NC-SN/WNWP-PG) "}]
[null,"Semiconductor",3.0563028186959746,{"$f":"INDEX(B$72:B$121,MATCH(C$139,J$72:J$121,0))","v":"PR-33-S (1\") F2-100"},2.3897034112758813,{"$f":"INDEX(B$72:B$121,MATCH(E$139,J$72:J$121,0))","v":"PR-33-S (3/4\") F2-075"},9000,{"$f":"INDEX(B$72:B$121,MATCH(G$139,J$72:J$121,0))","v":"Out of range"}]
[]
[null,null,null,"Food Industry",null,null,null,null,null,null,"Chemical industry",null,null,null,null,null,"Semiconductor"]
[]
[null,null,null,"Best",null,"2nd Best",null,"3rd best",null,null,"Best",null,"2nd Best",null,"3rd best",null,null,"Best",null,"2nd Best",null,"3rd best"]
[null,"PMFC-HSS-H04",0.5,{"$f":"IF(J72=0,9000,J72)","v":256.43130268296358},{"$f":"INDEX($F$181:$F$249,MATCH(D144,$E$181:$E$249,1))","v":10},{"$f":"IF(D144=$D$148,9000,D144)","v":9000},{"$f":"INDEX($F$181:$F$249,MATCH(F144,$E$181:$E$249,1))","v":0},{"$f":"IF(F144=$F$148,9000,F144)","v":9000},{"$f":"INDEX($F$181:$F$249,MATCH(H144,$E$181:$E$249,1))","v":0},"WFC-05",{"$f":"IF(J97=0,9000,J97)","v":3.3275757561422878},{"$f":"INDEX($F$181:$F$249,MATCH(K144,$E$181:$E$249,1))","v":15.749999999999995},{"$f":"IF(K144=$K$148,9000,K144)","v":3.3275757561422878},{"$f":"INDEX($F$181:$F$249,MATCH(M144,$E$181:$E$249,1))","v":15.749999999999995},{"$f":"IF(M144=$M$148,9000,M144)","v":9000},{"$f":"INDEX($F$181:$F$249,MATCH(O144,$E$181:$E$249,1))","v":0},"PR-33-S (1/4\")\n",{"$f":"IF(J92=0,9000,J92)","v":36.230506524630727},{"$f":"INDEX($F$181:$F$249,MATCH(R144,$E$181:$E$249,1))","v":10},{"$f":"IF(R144=R148,9000,R144)","v":36.230506524630727},{"$f":"INDEX($F$181:$F$249,MATCH(T144,$E$181:$E$249,1))","v":10},{"$f":"IF(T144=T148,9000,T144)","v":36.230506524630727},{"$f":"INDEX($F$181:$F$249,MATCH(V144,$E$181:$E$249,1))","v":10}]
[null,"PMFC-HSS-05",null,{"$f":"IF(J73=0,9000,J73)","v":37.766973708955163},{"$f":"INDEX($F$181:$F$249,MATCH(D145,$E$181:$E$249,1))","v":10},{"$f":"IF(D145=$D$148,9000,D145)","v":37.766973708955163},{"$f":"INDEX($F$181:$F$249,MATCH(F145,$E$181:$E$249,1))","v":10},{"$f":"IF(F145=$F$148,9000,F145)","v":9000},{"$f":"INDEX($F$181:$F$249,MATCH(H145,$E$181:$E$249,1))","v":0},"GFC-K60-P40-R05",{"$f":"IF(J101=0,9000,J101)","v":8.6790448486605261},{"$f":"INDEX($F$181:$F$249,MATCH(K145,$E$181:$E$249,1))","v":80},{"$f":"IF(K145=$K$148,9000,K145)","v":9000},{"$f":"INDEX($F$181:$F$249,MATCH(M145,$E$181:$E$249,1))","v":0},{"$f":"IF(M145=$M$148,9000,M145)","v":9000},{"$f":"INDEX($F$181:$F$249,MATCH(O145,$E$181:$E$249,1))","v":0},"PR-33-S (3/8\")",{"$f":"IF(J93=0,9000,J93)","v":18.366187675851286},{"$f":"INDEX($F$181:$F$249,MATCH(R145,$E$181:$E$249,1))","v":22},{"$f":"IF(R145=R148,9000,R145)","v":18.366187675851286},{"$f":"INDEX($F$181:$F$249,MATCH(T145,$E$181:$E$249,1))","v":22},{"$f":"IF(T145=T148,9000,T145)","v":9000},{"$f":"INDEX($F$181:$F$249,MATCH(V145,$E$181:$E$249,1))","v":0}]
[null,"PMFC-HSS-H06",null,29.089240668810227,{"$f":"INDEX($F$181:$F$249,MATCH(D146,$E$181:$E$249,1))","v":10},{"$f":"IF(D146=$D$148,9000,D146)","v":29.089240668810227},10,{"$f":"IF(F146=$F$148,9000,F146)","v":29.089240668810227},10,"FTC-A05",{"$f":"IF(J111=0,9000,J111)","v":1.1659899865269636},4.4499999999999957,{"$f":"IF(K146=$K$148,9000,K146)","v":1.1659899865269636},4.4499999999999957,{"$f":"IF(M146=$M$148,9000,M146)","v":1.1659899865269636},4.4499999999999957,"PR-33-S (1/2\")",{"$f":"IF(J94=0,9000,J94)","v":6.2602072153180899},94,{"$f":"IF(R146=R148,9000,R146)","v":9000},0,{"$f":"IF(T146=T148,9000,T146)","v":9000},0]
[null,null,null,null,null,null,null,null,null,null,null,null,null,null,null,null,"PR-33-S (3/4\")",{"$f":"IF(J95=0,9000,J95)","v":2.3897034112758813},9.3499999999999961,{"$f":"IF(R147=R148,9000,R147)","v":2.3897034112758813},9.3499999999999961,{"$f":"IF(T147=T148,9000,T147)","v":2.3897034112758813},9.3499999999999961]
[null,null,"tulos",{"$f":"INDEX(D144:D146,MATCH(E148,E144:E146,0))","v":256.43130268296358},{"$f":"MAX(E144:E147)","v":10},{"$f":"INDEX(F144:F146,MATCH(G148,G144:G146,0))","v":37.766973708955163},{"$f":"MAX(G144:G147)","v":10},{"$f":"INDEX(H144:H146,MATCH(I148,I144:I146,0))","v":29.089240668810227},{"$f":"MAX(I144:I147)","v":10},null,{"$f":"INDEX(K144:K146,MATCH(L148,L144:L146,0))","v":8.6790448486605261},{"$f":"MAX(L144:L147)","v":80},{"$f":"INDEX(M144:M146,MATCH(N148,N144:N146,0))","v":3.3275757561422878},{"$f":"MAX(N144:N147)","v":15.749999999999995},{"$f":"INDEX(O144:O146,MATCH(P148,P144:P146,0))","v":1.1659899865269636},{"$f":"MAX(P144:P147)","v":4.4499999999999957},null,{"$f":"INDEX(R144:R147,MATCH(S148,S144:S147,0))","v":6.2602072153180899},{"$f":"MAX(S144:S147)","v":94},{"$f":"INDEX(T144:T147,MATCH(U148,U144:U147,0))","v":18.366187675851286},{"$f":"MAX(U144:U147)","v":22},{"$f":"INDEX(V144:V147,MATCH(W148,W144:W147,0))","v":36.230506524630727},{"$f":"MAX(W144:W147)","v":10}]
[null,"SFC-HHSS-H10-90",1,{"$f":"IF(J84=0,9000,J84)","v":0.4151384960893672},{"$f":"INDEX($F$181:$F$249,MATCH(D149,$E$181:$E$249,1))","v":1.6499999999999952},{"$f":"IF(D149=$D$156,9000,D149)","v":0.4151384960893672},{"$f":"INDEX($F$181:$F$249,MATCH(F149,$E$181:$E$249,1))","v":1.6499999999999952},{"$f":"IF(F149=$F$156,9000,F149)","v":0.4151384960893672},1.6499999999999952,"FTC-A10",{"$f":"IF(J112=0,9000,J112)","v":1.1913825261170674},4.4499999999999957,{"$f":"IF(K149=$K$156,9000,K149)","v":1.1913825261170674},4.4499999999999957,{"$f":"IF(M149=$M$156,9000,M149)","v":1.1913825261170674},4.4499999999999957,"PR-33-S (3/4\")",{"$f":"IF(J95=0,9000,J95)","v":2.3897034112758813},9.3499999999999961,{"$f":"IF(R149=$R$156,9000,R149)","v":2.3897034112758813},9.3499999999999961,{"$f":"IF(T149=T$156,9000,T149)","v":9000},0]
[null,"SFC-HHSS-H10-180",null,{"$f":"IF(J85=0,9000,J85)","v":0.26544061734305907},0.94999999999999529,0.26544061734305907,0.94999999999999529,0.26544061734305907,0.94999999999999529,"WFC-10 ",{"$f":"IF(J98=0,9000,J98)","v":1.473175960059542},5.8499999999999961,1.473175960059542,5.8499999999999961,{"$f":"IF(M150=$M$156,9000,M150)","v":1.473175960059542},5.8499999999999961,"PR-33-S (1\")",{"$f":"IF(J96=0,9000,J96)","v":3.0563028186959746},12.899999999999995,{"$f":"IF(R150=$R$156,9000,R150)","v":9000},0,{"$f":"IF(T150=T$156,9000,T150)","v":9000},0]
[null,"AFC-HSS-H10-SI ",null,{"$f":"IF(J75=0,9000,J75)","v":1.433202176399565},5.8499999999999961,1.433202176399565,5.8499999999999961,9000,0,"PFC-23-GP-A10",{"$f":"IF(J106=0,9000,J106)","v":0.31268255146418195},0.94999999999999529,0.31268255146418195,0.94999999999999529,{"$f":"IF(M151=$M$156,9000,M151)","v":0.31268255146418195},0.94999999999999529,null,9000,0,9000,0,9000,0]
[null,"AFC-HSS-H10-RI ",null,{"$f":"IF(J76=0,9000,J76)","v":1.7916503515435847},7.2499999999999964,9000,0,9000,0,"PFC-KSS-A10",{"$f":"IF(J105=0,9000,J105)","v":2.2137632236939035},8.6499999999999968,2.2137632236939035,8.6499999999999968,{"$f":"IF(M152=$M$156,9000,M152)","v":9000},0]
[null,"AFC-HSS-H15-SI ",null,{"$f":"IF(J77=0,9000,J77)","v":0.79055799052362086},3.0499999999999954,0.79055799052362086,3.0499999999999954,0.79055799052362086,3.0499999999999954,"CFC-M10",{"$f":"IF(J115=0,9000,J115)","v":1.3747402829246755},5.1499999999999959,1.3747402829246755,5.1499999999999959,{"$f":"IF(M153=$M$156,9000,M153)","v":1.3747402829246755},5.1499999999999959]
[null,"AFC-HSS-H15-RI ",null,{"$f":"IF(J78=0,9000,J78)","v":1.1962760783030677},4.4499999999999957,1.1962760783030677,4.4499999999999957,1.1962760783030677,4.4499999999999957,"GFC-K60-P40J15-P10",{"$f":"IF(J100=0,9000,J100)","v":9.2501275581206563},76,9000,0,{"$f":"IF(M154=$M$156,9000,M154)","v":9000},0]
[null,null,null,null,null,null,null,null,null,"GFC-K60-P40-R10",{"$f":"IF(J102=0,9000,J102)","v":1.98313109118668},7.9499999999999966,1.98313109118668,7.9499999999999966,{"$f":"IF(M155=$M$156,9000,M155)","v":1.98313109118668},7.9499999999999966]
[null,null,"tulos",{"$f":"INDEX(D149:D154,MATCH(E156,E149:E154,0))","v":1.7916503515435847},{"$f":"MAX(E149:E155)","v":7.2499999999999964},{"$f":"INDEX(F149:F154,MATCH(G156,G149:G154,0))","v":1.433202176399565},{"$f":"MAX(G149:G155)","v":5.8499999999999961},{"$f":"INDEX(H149:H154,MATCH(I156,I149:I154,0))","v":1.1962760783030677},{"$f":"MAX(I149:I155)","v":4.4499999999999957},null,{"$f":"INDEX(K149:K155,MATCH(L156,L149:L155,0))","v":9.2501275581206563},{"$f":"MAX(L149:L155)","v":76},{"$f":"INDEX(M149:M155,MATCH(N156,N149:N155,0))","v":2.2137632236939035},{"$f":"MAX(N149:N155)","v":8.6499999999999968},{"$f":"INDEX(O149:O155,MATCH(P156,P149:P155,0))","v":1.98313109118668},{"$f":"MAX(P149:P155)","v":7.9499999999999966},null,{"$f":"INDEX(R149:R151,MATCH(S156,S149:S151,0))","v":3.0563028186959746},{"$f":"MAX(S149:S151)","v":12.899999999999995},{"$f":"INDEX(T149:T151,MATCH(U156,U149:U151,0))","v":2.3897034112758813},{"$f":"MAX(U149:U151)","v":9.3499999999999961},{"$f":"INDEX(V149:V151,MATCH(W156,W149:W151,0))","v":9000},{"$f":"MAX(W149:W151)","v":0}]
[null,"SFC-HHSS-H15-90",1.5,{"$f":"IF(J86=0,9000,J86)","v":0.26780271404911526},0.94999999999999529,{"$f":"IF(D157=$D$161,9000,D157)","v":0.26780271404911526},0.94999999999999529,{"$f":"IF(F157=$F$161,9000,F157)","v":0.26780271404911526},0.94999999999999529,"FTC-A15",{"$f":"IF(J113=0,9000,J113)","v":0.47773405879985498},1.6499999999999952,{"$f":"IF(K157=$K$161,9000,K157)","v":9000},0,{"$f":"IF(M157=$M$161,9000,M157)","v":9000},0,null,9000,null,9000,null,9000]
[null,"SFC-HHSS-H15-180",null,{"$f":"IF(J87=0,9000,J87)","v":0.1446784232459388},0.24999999999999534,{"$f":"IF(D158=$D$161,9000,D158)","v":0.1446784232459388},0.24999999999999534,{"$f":"IF(F158=$F$161,9000,F158)","v":0.1446784232459388},0.24999999999999534,"WFC-15",{"$f":"IF(J99=0,9000,J99)","v":0.52702309380995771},1.6499999999999952,{"$f":"IF(K158=$K$161,9000,K158)","v":0.52702309380995771},1.6499999999999952,{"$f":"IF(M158=$M$161,9000,M158)","v":9000},0,null,9000,null,9000,null,9000]
[null,"AFC-HSS-H15-SI ",null,{"$f":"IF(J77=0,9000,J77)","v":0.79055799052362086},3.0499999999999954,{"$f":"IF(D159=$D$161,9000,D159)","v":0.79055799052362086},3.0499999999999954,{"$f":"IF(F159=$F$161,9000,F159)","v":9000},0,"PFC-23-GP-A15",{"$f":"IF(J107=0,9000,J107)","v":0.32596934543574779},0.94999999999999529,{"$f":"IF(K159=$K$161,9000,K159)","v":0.32596934543574779},0.94999999999999529,{"$f":"IF(M159=$M$161,9000,M159)","v":0.32596934543574779},0.94999999999999529,null,9000,null,9000,null,9000]
[null,"AFC-HSS-H15-RI ",null,{"$f":"IF(J78=0,9000,J78)","v":1.1962760783030677},4.4499999999999957,{"$f":"IF(D160=$D$161,9000,D160)","v":9000},0,{"$f":"IF(F160=$F$161,9000,F160)","v":9000},0]
[null,null,"tulos",{"$f":"INDEX(D157:D160,MATCH(E161,E157:E160,0))","v":1.1962760783030677},{"$f":"MAX(E157:E160)","v":4.4499999999999957},{"$f":"INDEX(F157:F160,MATCH(G161,G157:G160,0))","v":0.79055799052362086},{"$f":"MAX(G157:G160)","v":3.0499999999999954},{"$f":"INDEX(H157:H160,MATCH(I161,I157:I160,0))","v":0.26780271404911526},{"$f":"MAX(I157:I160)","v":0.94999999999999529},null,{"$f":"INDEX(K157:K159,MATCH(L161,L157:L159,0))","v":0.47773405879985498},{"$f":"MAX(L157:L160)","v":1.6499999999999952},{"$f":"INDEX(M157:M159,MATCH(N161,N157:N159,0))","v":0.52702309380995771},{"$f":"MAX(N157:N160)","v":1.6499999999999952},{"$f":"INDEX(O157:O159,MATCH(P161,P157:P159,0))","v":0.32596934543574779},{"$f":"MAX(P157:P160)","v":0.94999999999999529},null,{"$f":"INDEX(R157:R159,MATCH(MIN(ABS(R157:R159-$D$131)),ABS(R157:R159-$D$131),0))","v":9000},null,{"$f":"INDEX(T157:T159,MATCH(MIN(ABS(T157:T159-$D$131)),ABS(T157:T159-$D$131),0))","v":9000},null,{"$f":"INDEX(V157:V159,MATCH(MIN(ABS(V157:V159-$D$131)),ABS(V157:V159-$D$131),0))","v":9000}]
[null,"SFC-HHSS-H20-90",2,{"$f":"IF(J88=0,9000,J88)","v":0.22509662468142877},0.94999999999999529,{"$f":"IF(D162=$D$166,9000,D162)","v":0.22509662468142877},0.94999999999999529,{"$f":"IF(F162=$F$166,9000,F162)","v":9000},0,"FTC-A20",{"$f":"IF(J114=0,9000,J114)","v":0.26986954866691437},0.94999999999999529,{"$f":"IF(K162=$K$166,9000,K162)","v":0.26986954866691437},0.94999999999999529,{"$f":"IF(M162=$M$166,9000,M162)","v":9000},0,null,9000,null,9000,null,9000]
[null,"SFC-HHSS-H20-180",null,{"$f":"IF(J89=0,9000,J89)","v":8.7692840212334325E-2},0.24999999999999534,{"$f":"IF(D163=$D$166,9000,D163)","v":8.7692840212334325E-2},0.24999999999999534,{"$f":"IF(F163=$F$166,9000,F163)","v":8.7692840212334325E-2},0.24999999999999534,"CFC-M20",{"$f":"IF(J116=0,9000,J116)","v":0.4547036159158076},1.6499999999999952,{"$f":"IF(K163=$K$166,9000,K163)","v":9000},0,{"$f":"IF(M163=$M$166,9000,M163)","v":9000},0,null,9000,null,9000,null,9000]
[null,"AFC-HSS-H20-SI ",null,{"$f":"IF(J79=0,9000,J79)","v":0.29467156408050388},0.94999999999999529,{"$f":"IF(D164=$D$166,9000,D164)","v":0.29467156408050388},0.94999999999999529,{"$f":"IF(F164=$F$166,9000,F164)","v":0.29467156408050388},0.94999999999999529,"PR-23-W20",{"$f":"IF(J108=0,9000,J108)","v":4.2517740709010578E-2},0.24999999999999534,{"$f":"IF(K164=$K$166,9000,K164)","v":4.2517740709010578E-2},0.24999999999999534,{"$f":"IF(M164=$M$166,9000,M164)","v":4.2517740709010578E-2},0.24999999999999534,null,9000,null,9000,null,9000]
[null,"AFC-HSS-H20-RI ",null,{"$f":"IF(J80=0,9000,J80)","v":0.58290081893414392},2.3499999999999952,{"$f":"IF(D165=$D$166,9000,D165)","v":9000},0,{"$f":"IF(F165=$F$166,9000,F165)","v":9000},0]
[null,null,"tulos",{"$f":"INDEX(D162:D165,MATCH(E166,E162:E165,0))","v":0.58290081893414392},{"$f":"MAX(E162:E165)","v":2.3499999999999952},{"$f":"INDEX(F162:F165,MATCH(G166,G162:G165,0))","v":0.22509662468142877},{"$f":"MAX(G162:G165)","v":0.94999999999999529},{"$f":"INDEX(H162:H165,MATCH(I166,I162:I165,0))","v":0.29467156408050388},{"$f":"MAX(I162:I165)","v":0.94999999999999529},null,{"$f":"INDEX(K162:K165,MATCH(L166,L162:L165,0))","v":0.4547036159158076},{"$f":"MAX(L162:L165)","v":1.6499999999999952},{"$f":"INDEX(M162:M165,MATCH(N166,N162:N165,0))","v":0.26986954866691437},{"$f":"MAX(N162:N165)","v":0.94999999999999529},{"$f":"INDEX(O162:O165,MATCH(P166,P162:P165,0))","v":4.2517740709010578E-2},{"$f":"MAX(P162:P165)","v":0.24999999999999534},null,{"$f":"INDEX(R161:R164,MATCH(MIN(ABS(R161:R164-$D$131)),ABS(R161:R164-$D$131),0))","v":9000},null,{"$f":"INDEX(T161:T164,MATCH(MIN(ABS(T161:T164-$D$131)),ABS(T161:T164-$D$131),0))","v":9000},null,{"$f":"INDEX(V161:V164,MATCH(MIN(ABS(V161:V164-$D$131)),ABS(V161:V164-$D$131),0))","v":9000}]
[null,"SFC-HHSS-H25-90",2.5,{"$f":"IF(J90=0,9000,J90)","v":9.4275785854750604E-2},0.24999999999999534,{"$f":"IF(D167=$D$170,9000,D167)","v":9.4275785854750604E-2},0.24999999999999534,{"$f":"IF(F167=$F$170,9000,F167)","v":9000},0,"GFK-K60-P40-D25",{"$f":"IF(J104=0,9000,J104)","v":1.9131724285911071},7.2499999999999964,{"$f":"IF(K167=$K$170,9000,K167)","v":9000},0,{"$f":"IF(M167=$M$170,9000,M167)","v":9000},0,null,9000,null,9000,null,9000]
[null,"SFC-HHSS-H25-180",null,{"$f":"IF(J91=0,9000,J91)","v":0.16247261027204557},0.24999999999999534,{"$f":"IF(D168=$D$170,9000,D168)","v":0.16247261027204557},0.24999999999999534,{"$f":"IF(F168=$F$170,9000,F168)","v":0.16247261027204557},0.24999999999999534,null,9000,0,9000,0,9000,0,null,9000,null,9000,null,9000]
[null,"AFC-HSS-H25-SI ",null,{"$f":"IF(J81=0,9000,J81)","v":0.18217670845458006},0.94999999999999529,{"$f":"IF(D169=$D$170,9000,D169)","v":9000},0,{"$f":"IF(F169=$F$170,9000,F169)","v":9000},0,null,9000,0,9000,0,9000,0,null,9000,null,9000,null,9000]
[null,null,"tulos",{"$f":"INDEX(D167:D169,MATCH(E170,E167:E169,0))","v":0.18217670845458006},{"$f":"MAX(E167:E169)","v":0.94999999999999529},{"$f":"INDEX(F167:F169,MATCH(G170,G167:G169,0))","v":9.4275785854750604E-2},{"$f":"MAX(G167:G169)","v":0.24999999999999534},{"$f":"INDEX(H167:H169,MATCH(I170,I167:I169,0))","v":0.16247261027204557},{"$f":"MAX(I167:I169)","v":0.24999999999999534},null,{"$f":"INDEX(K167:K169,MATCH(L170,L167:L169,0))","v":1.9131724285911071},{"$f":"MAX(L167:L169)","v":7.2499999999999964},{"$f":"INDEX(M167:M169,MATCH(N170,N167:N169,0))","v":9000},{"$f":"MAX(N167:N169)","v":0},{"$f":"INDEX(O167:O169,MATCH(P170,P167:P169,0))","v":9000},{"$f":"MAX(P167:P169)","v":0},null,{"$f":"INDEX(R167:R169,MATCH(MIN(ABS(R167:R169-$D$131)),ABS(R167:R169-$D$131),0))","v":9000},null,{"$f":"INDEX(T167:T169,MATCH(MIN(ABS(T167:T169-$D$131)),ABS(T167:T169-$D$131),0))","v":9000},null,{"$f":"INDEX(V167:V169,MATCH(MIN(ABS(V167:V169-$D$131)),ABS(V167:V169-$D$131),0))","v":9000}]
[null,"AFC-HSS-H30-SI",3,{"$f":"IF(J82=0,9000,J82)","v":0.14766591600881374},0.24999999999999534,{"$f":"IF(D171=$D$174,9000,D171)","v":9000},0,{"$f":"IF(F171=$F$174,9000,F171)","v":9000},0,"PR-23-W30",{"$f":"IF(J109=0,9000,J109)","v":1.9192035736706164E-2},0.24999999999999534,{"$f":"IF(K171=$K$174,9000,K171)","v":9000},0,{"$f":"IF(M171=$M$174,9000,M171)","v":9000},0,null,9000,null,9000,null,9000]
[null,null,null,9000,0,9000,0,9000,0,null,9000,0,9000,0,9000,0,null,9000,null,9000,null,9000]
[null,null,null,9000,0,9000,0,9000,0,null,9000,0,9000,0,9000,0,null,9000,null,9000,null,9000]
[null,null,"tulos",{"$f":"INDEX(D171:D173,MATCH(E174,E171:E173,0))","v":0.14766591600881374},{"$f":"MAX(E171:E173)","v":0.24999999999999534},{"$f":"INDEX(F171:F173,MATCH(G174,G171:G173,0))","v":9000},{"$f":"MAX(G171:G173)","v":0},{"$f":"INDEX(H171:H173,MATCH(I174,I171:I173,0))","v":9000},{"$f":"MAX(I171:I173)","v":0},null,{"$f":"INDEX(K171:K173,MATCH(L174,L171:L173,0))","v":1.9192035736706164E-2},{"$f":"MAX(L171:L173)","v":0.24999999999999534},{"$f":"INDEX(M171:M173,MATCH(N174,N171:N173,0))","v":9000},{"$f":"MAX(N171:N173)","v":0},{"$f":"INDEX(O171:O173,MATCH(P174,P171:P173,0))","v":9000},{"$f":"MAX(P171:P173)","v":0},null,{"$f":"INDEX(R171:R173,MATCH(MIN(ABS(R171:R173-$D$131)),ABS(R171:R173-$D$131),0))","v":9000},null,{"$f":"INDEX(T171:T173,MATCH(MIN(ABS(T171:T173-$D$131)),ABS(T171:T173-$D$131),0))","v":9000},null,{"$f":"INDEX(V171:V173,MATCH(MIN(ABS(V171:V173-$D$131)),ABS(V171:V173-$D$131),0))","v":9000}]
[null,"AFC-HSS-H40-SI",4,{"$f":"IF(J83=0,9000,J83)","v":7.2947171739635802E-2},0.24999999999999534,{"$f":"IF(D175=$D$178,9000,D175)","v":9000},0,{"$f":"IF(F175=$F$178,9000,F175)","v":9000},0,"PR-23-W40",{"$f":"IF(J110=0,9000,J110)","v":1.0038911000738608E-2},0.24999999999999534,{"$f":"IF(K175=$K$178,9000,K175)","v":9000},0,{"$f":"IF(M175=$M$178,9000,M175)","v":9000},0,null,9000,null,9000,null,9000]
[null,null,null,9000,0,9000,0,9000,0,null,9000,0,9000,0,9000,0,null,9000,null,9000,null,9000]
[null,null,null,9000,0,9000,0,9000,0,null,9000,0,9000,0,9000,0,null,9000,null,9000,null,9000]
[null,null,"tulos",{"$f":"INDEX(D175:D177,MATCH(E178,E175:E177,0))","v":7.2947171739635802E-2},{"$f":"MAX(E175:E177)","v":0.24999999999999534},{"$f":"INDEX(F175:F177,MATCH(G178,G175:G177,0))","v":9000},{"$f":"MAX(G175:G177)","v":0},{"$f":"INDEX(H175:H177,MATCH(I178,I175:I177,0))","v":9000},{"$f":"MAX(I175:I177)","v":0},null,{"$f":"INDEX(K175:K177,MATCH(L178,L175:L177,0))","v":1.0038911000738608E-2},{"$f":"MAX(L175:L177)","v":0.24999999999999534},{"$f":"INDEX(M175:M177,MATCH(N178,N175:N177,0))","v":9000},{"$f":"MAX(N175:N177)","v":0},{"$f":"INDEX(O175:O177,MATCH(P178,P175:P177,0))","v":9000},{"$f":"MAX(P175:P177)","v":0},null,{"$f":"INDEX(R175:R177,MATCH(MIN(ABS(R175:R177-$D$131)),ABS(R175:R177-$D$131),0))","v":9000},null,{"$f":"INDEX(T175:T177,MATCH(MIN(ABS(T175:T177-$D$131)),ABS(T175:T177-$D$131),0))","v":9000},null,{"$f":"INDEX(V175:V177,MATCH(MIN(ABS(V175:V177-$D$131)),ABS(V175:V177-$D$131),0))","v":9000}]
[]
[]
[null,null,null,null,0,{"$f":"F182-0.7","v":0.24999999999999534},null,"0 - 2.5 ft/s"]
[null,null,null,null,{"$f":"E181+0.1785","v":0.17849999999999999},0.94999999999999529,null,"2.5 - 5 ft/s"]
[null,null,null,null,{"$f":"E182+0.1785","v":0.35699999999999998},1.6499999999999952,null,"5 - 16.5 ft/s"]
[null,null,null,null,0.53549999999999998,2.3499999999999952,null,"16.5 - 20 ft/s"]
[null,null,null,null,0.71399999999999997,3.0499999999999954,null,"over 20 ft/s"]
[null,null,null,null,0.89249999999999996,3.7499999999999956]
[null,null,null,null,1.071,4.4499999999999957]
[null,null,null,null,1.2494999999999998,5.1499999999999959]
[null,null,null,null,1.4279999999999999,5.8499999999999961]
[null,null,null,null,1.6065,6.5499999999999963]
[null,null,null,null,1.7850000000000001,7.2499999999999964]
[null,null,null,null,1.9635000000000002,7.9499999999999966]
[null,null,null,null,2.1420000000000003,8.6499999999999968]
[null,null,null,null,2.3205000000000005,9.3499999999999961]
[null,null,null,null,2.5,{"$f":"F196-2.85","v":10.049999999999995}]
[null,null,null,null,{"$f":"E195+0.3125","v":2.8125},12.899999999999995]
[null,null,null,null,{"$f":"E196+0.3125","v":3.125},15.749999999999995]
[null,null,null,null,3.4375,18.599999999999994]
[null,null,null,null,3.75,21.449999999999996]
[null,null,null,null,4.0625,24.299999999999997]
[null,null,null,null,4.375,27.15]
[null,null,null,null,4.6875,30]
[null,null,null,null,5,100]
[null,null,null,null,{"$f":"E203+0.338","v":5.3380000000000001},{"$f":"F203-2","v":98}]
[null,null,null,null,{"$f":"E204+0.338","v":5.6760000000000002},{"$f":"F204-2","v":96}]
[null,null,null,null,6.0140000000000002,94]
[null,null,null,null,6.3520000000000003,92]
[null,null,null,null,6.69,90]
[null,null,null,null,7.0280000000000005,88]
[null,null,null,null,7.3660000000000005,86]
[null,null,null,null,7.7040000000000006,84]
[null,null,null,null,8.0419999999999998,82]
[null,null,null,null,8.379999999999999,80]
[null,null,null,null,8.7179999999999982,78]
[null,null,null,null,9.0559999999999974,76]
[null,null,null,null,9.3939999999999966,74]
[null,null,null,null,9.7319999999999958,72]
[null,null,null,null,10.069999999999995,70]
[null,null,null,null,10.407999999999994,68]
[null,null,null,null,10.745999999999993,66]
[null,null,null,null,11.083999999999993,64]
[null,null,null,null,11.421999999999992,62]
[null,null,null,null,11.759999999999991,60]
[null,null,null,null,12.09799999999999,58]
[null,null,null,null,12.435999999999989,56]
[null,null,null,null,12.773999999999988,54]
[null,null,null,null,13.111999999999988,52]
[null,null,null,null,13.449999999999987,50]
[null,null,null,null,13.787999999999986,48]
[null,null,null,null,14.125999999999985,46]
[null,null,null,null,14.463999999999984,44]
[null,null,null,null,14.801999999999984,42]
[null,null,null,null,15.139999999999983,40]
[null,null,null,null,15.477999999999982,38]
[null,null,null,null,15.815999999999981,36]
[null,null,null,null,16.153999999999982,34]
[null,null,null,null,16.5,32]
[null,null,null,null,{"$f":"E237+0.32","v":16.82},30]
[null,null,null,null,{"$f":"E238+0.32","v":17.14},28]
[null,null,null,null,17.46,26]
[null,null,null,null,17.78,24]
[null,null,null,null,18.100000000000001,22]
[null,null,null,null,18.420000000000002,20]
[null,null,null,null,18.740000000000002,18]
[null,null,null,null,19.060000000000002,16]
[null,null,null,null,19.380000000000003,14]
[null,null,null,null,19.700000000000003,12]
[null,null,null,null,20,10]
[null,null,null,null,9000,0]

{"sheet":"Metric","index":1,"n_rows":249,"n_cols":23,"rows_kept":249,"cut":false,"hidden":true,"merged":[[52,7,52,8],[49,4,49,5],[36,4,36,5],[37,4,37,5],[38,4,38,5],[42,10,42,11],[42,7,42,8],[42,4,42,5],[34,4,34,5],[35,10,35,11],[36,10,36,11],[38,10,38,11],[35,7,35,8],[36,7,36,8],[37,7,37,8],[38,7,38,8],[35,4,35,5],[14,4,14,5],[14,7,14,8],[28,10,28,11],[28,7,28,8],[28,4,28,5],[14,10,14,11],[21,7,21,8],[22,7,22,8],[23,7,23,8],[24,7,24,8],[21,4,21,5],[22,4,22,5],[23,4,23,5],[24,4,24,5],[20,7,20,8],[115,5,115,6],[21,10,21,11],[22,10,22,11],[23,10,23,11],[24,10,24,11],[20,10,20,11],[34,10,34,11],[34,7,34,8],[48,10,48,11],[48,7,48,8],[111,5,111,6],[110,5,110,6],[112,5,112,6],[113,5,113,6],[114,5,114,6],[105,5,105,6],[106,5,106,6],[107,5,107,6],[108,5,108,6],[109,5,109,6],[98,5,98,6],[99,5,99,6],[37,10,37,11],[20,4,20,5],[100,5,100,6],[101,5,101,6],[104,5,104,6],[92,5,92,6],[93,5,93,6],[94,5,94,6],[95,5,95,6],[96,5,96,6],[97,5,97,6],[102,5,102,6],[103,5,103,6],[86,5,86,6],[87,5,87,6],[88,5,88,6],[89,5,89,6],[90,5,90,6],[91,5,91,6],[80,5,80,6],[81,5,81,6],[82,5,82,6],[83,5,83,6],[84,5,84,6],[85,5,85,6],[74,5,74,6],[75,5,75,6],[76,5,76,6],[77,5,77,6],[78,5,78,6],[79,5,79,6],[69,1,70,2],[69,5,70,6],[71,5,71,6],[72,5,72,6],[73,5,73,6],[27,1,27,3],[41,1,41,3],[31,1,31,2],[45,1,45,2],[58,1,58,2],[60,1,60,3],[68,1,68,2],[2,5,2,8],[4,1,4,3],[5,4,5,5],[13,1,13,3],[17,1,17,2],[50,4,50,5],[51,4,51,5],[52,4,52,5],[56,1,56,12],[48,4,48,5],[49,10,49,11],[50,10,50,11],[51,10,51,11],[52,10,52,11],[49,7,49,8],[50,7,50,8],[51,7,51,8]]}
[]
[]
[null,null,null,null,null,"Flow Cell Selector"]
[null,null,null,null,null,null,null,null,null,null,null,null,"Ver1.8.2"]
[null,"Select Industry:",null,null,null,null,null,null,null,null,null,null,null,null,"EXAMPLE: Section view of GFC-K60-P40-SS-J15-P10 flowcell."]
[null,null,null,null,"Set Inch / Metric:"]
[null,null,null,"Insert values. Calculator shows three best suited flow cell options for the pipe size and flow rate"]
[]
[null,null,null,null,"Flow rate Q =",2.95,"m^3/h",null,"Pipe Size =",25.4,"mm"]
[null,null,null,null,null,{"$f":"IF(F9>240,\"Out of Range\",\" \")","v":" "}]
[null,null,"Recommended prism flow velocity is 1.5 m/s or higher for a sugar solution. Other liquids recommended flow velocity depends on medium viscosity, purity and temperature."]
[null,null,"Recommended maximum flow in the flow cell is 6 m/s for all flow cells. With velocities above this there is a risk for cavitation."]
[]
[null,"Chemical Industry"]
[null,null,null,null,{"$f":"ROUND(Metric!$C$137,1) & \" m/s\"","v":"2 m/s"},null,null,{"$f":"ROUND(Metric!$E$137,1) & \" m/s \"","v":"2.2 m/s "},null,null,{"$f":"ROUND(Metric!$G$137,1) & \" m/s \"","v":"1.5 m/s "},null,null,null,"Flow rate Q: Inlet flow. Use the flow calculator below to determine flow rate if not provided by the customer."]
[null,null,null,null,null,null,null,null,null,null,null,null,null,null,"Pipe size: Installation site's pipe size. Flow cell selector has 7 options of standard pipe sizes, but the options might be limited by chosen industry."]
[null,null,null,null,null,null,null,null,null,null,null,null,null,null,"Inlet size: \"True size\" of the pipe connection."]
[null,"Flow on prism",null,null,null,null,null,null,null,null,null,null,null,null,"Flow on prism: Flow velocity measured over the the prism. Always measured from the same surface area."]
[null,null,null,null,null,null,null,null,null,null,null,null,null,null,"Max flow in flowcell: Maximum measured flow velocity inside flowcell. Can occur anywhere in flowcell, depending on the model."]
[null,null,null,null,null,null,null,null,null,null,null,null,null,null,"Pressure drop: Measured drop of pressure when comparing inlet flow vs. outlet flow pressure."]
[null,null,null,null,{"$f":"Metric!$D$137","v":"GFC-K60-P40-SS-R10/N10/A10/D25-PXX-SN/WN/WP-PG"},null,null,{"$f":"Metric!$F$137","v":"PFC-KSS-A10"},null,null,{"$f":"Metric!$H$137","v":"WFC-KSS-A/D/J-10-NC-SN/WNWP/PG"}]
[null,"Pipe size",null,null,{"$f":"INDEX(H$72:H$120,MATCH(D$137,B$72:B$120,0))","v":25.4},null,null,{"$f":"INDEX(H$72:H$120,MATCH(F$137,B$72:B$120,0))","v":25.4},null,null,{"$f":"INDEX(H$72:H$120,MATCH(H$137,B$72:B$120,0))","v":25.4},null,"mm"]
[null,"Inlet diameter",null,null,{"$f":"INDEX(I$72:I$120,MATCH(D$137,B$72:B$120,0))","v":22.36},null,null,{"$f":"INDEX(I$72:I$120,MATCH(F$137,B$72:B$120,0))","v":26.94},null,null,{"$f":"INDEX(I$72:I$120,MATCH(H$137,B$72:B$120,0))","v":26.7},null,"mm"]
[null,"Pressure drop",null,null,{"$f":"INDEX(K$72:K$120,MATCH(D$137,B$72:B$120,0))","v":0.17770799999999998},null,null,{"$f":"INDEX(K$72:K$120,MATCH(F$137,B$72:B$120,0))","v":5.3970250000000004E-2},null,null,{"$f":"INDEX(K$72:K$120,MATCH(H$137,B$72:B$120,0))","v":7.5165999999999997E-2},null,"bar"]
[null,"Flow on prism",null,null,{"$f":"ROUND(Metric!$C$137,1)","v":2},null,null,{"$f":"ROUND(Metric!$E$137,1)","v":2.2000000000000002},null,null,{"$f":"ROUND(Metric!$G$137,1)","v":1.5},null,"m/s"]
[]
[]
[null,"Food Industry"]
[null,null,null,null,{"$f":"ROUND(Metric!$C$138,1) & \" m/s\"","v":"1.8 m/s"},null,null,{"$f":"ROUND(Metric!$E$138,1) & \" m/s \"","v":"1.4 m/s "},null,null,{"$f":"ROUND(Metric!$G$138,1) & \" m/s \"","v":"0.4 m/s "},null,null,null,"Flow rate Q: Inlet flow. Use the flow calculator below to determine flow rate if not provided by the customer."]
[null,null,null,null,null,null,null,null,null,null,null,null,null,null,"Pipe size: Installation site's pipe size. Flow cell selector has 7 options of standard pipe sizes, but the options might be limited by chosen industry."]
[null,null,null,null,null,null,null,null,null,null,null,null,null,null,"Inlet size: \"True size\" of the pipe connection."]
[null,"Flow on prism",null,null,null,null,null,null,null,null,null,null,null,null,"Flow on prism: Flow velocity measured over the the prism. Always measured from the same surface area."]
[null,null,null,null,null,null,null,null,null,null,null,null,null,null,"Max flow in flowcell: Maximum measured flow velocity inside flowcell. Can occur anywhere in flowcell, depending on the model."]
[null,null,null,null,null,null,null,null,null,null,null,null,null,null,"Pressure drop: Measured drop of pressure when comparing inlet flow vs. outlet flow pressure."]
[null,null,null,null,{"$f":"Metric!$D$138","v":"AFC-HSS-H10-RI (-NC-SN/WNWP-PG) "},null,null,{"$f":"Metric!$F$138","v":"AFC-HSS-H10-SI (-NC-SN/WNWP-PG)"},null,null,{"$f":"Metric!$H$138","v":"SFC-HHSS-H10-90"}]
[null,"Pipe size",null,null,{"$f":"INDEX(H$72:H$120,MATCH(D$138,B$72:B$120,0))","v":25.4},null,null,{"$f":"INDEX(H$72:H$120,MATCH(F$138,B$72:B$120,0))","v":25.4},null,null,{"$f":"INDEX(H$72:H$120,MATCH(H$138,B$72:B$120,0))","v":25.4},null,"mm"]
[null,"Inlet diameter",null,null,{"$f":"INDEX(I$72:I$120,MATCH(D$138,B$72:B$120,0))","v":22.6},null,null,{"$f":"INDEX(I$72:I$120,MATCH(F$138,B$72:B$120,0))","v":22.6},null,null,{"$f":"INDEX(I$72:I$120,MATCH(H$138,B$72:B$120,0))","v":22.6},null,"mm"]
[null,"Pressure drop",null,null,{"$f":"INDEX(K$72:K$120,MATCH(D$138,B$72:B$120,0))","v":6.4162500000000011E-2},null,null,{"$f":"INDEX(K$72:K$120,MATCH(F$138,B$72:B$120,0))","v":2.6992500000000003E-2},null,null,{"$f":"INDEX(K$72:K$120,MATCH(H$138,B$72:B$120,0))","v":3.0517750000000003E-2},null,"bar"]
[null,"Flow on prism",null,null,{"$f":"ROUND(Metric!$C$138,1)","v":1.8},null,null,{"$f":"ROUND(Metric!$E$138,1)","v":1.4},null,null,{"$f":"ROUND(Metric!$G$138,1)","v":0.4},null,"m/s"]
[]
[]
[null,"Semiconductor"]
[null,null,null,null,{"$f":"ROUND(Metric!$C$139,1) & \" m/s \"","v":"2.4 m/s "},null,null,{"$f":"ROUND(Metric!$E$139,1) & \" m/s \"","v":"3.1 m/s "},null,null,{"$f":"ROUND(Metric!$G$139,1) & \" m/s \"","v":"9000 m/s "},null,null,null,"Flow rate Q: Inlet flow. Use the flow calculator below to determine flow rate if not provided by the customer."]
[null,null,null,null,null,null,null,null,null,null,null,null,null,null,"Pipe size: Installation site's pipe size. Flow cell selector has 7 options of standard pipe sizes, but the options might be limited by chosen industry."]
[null,null,null,null,null,null,null,null,null,null,null,null,null,null,"Inlet size: \"True size\" of the pipe connection."]
[null,"Flow on prism",null,null,null,null,null,null,null,null,null,null,null,null,"Flow on prism: Flow velocity measured over the the prism. Always measured from the same surface area."]
[null,null,null,null,null,null,null,null,null,null,null,null,null,null,"Max flow in flowcell: Maximum measured flow velocity inside flowcell. Can occur anywhere in flowcell, depending on the model."]
[null,null,null,null,null,null,null,null,null,null,null,null,null,null,"Pressure drop: Measured drop of pressure when comparing inlet flow vs. outlet flow pressure."]
[null,null,null,null,{"$f":"Metric!$D$139","v":"PR-33-S (3/4\") F2-075"},null,null,{"$f":"Metric!$F$139","v":"PR-33-S (1\") F2-100"},null,null,{"$f":"Metric!$H$139","v":"Out of range"}]
[null,"Pipe size           ",null,null,{"$f":"INDEX(H$72:H$120,MATCH(D139,B$72:B$120,0))","v":19.05},null,null,{"$f":"INDEX(H$72:H$120,MATCH(F139,B$72:B$120,0))","v":25.4},null,null,{"$f":"INDEX(H$72:H$120,MATCH(H139,B$72:B$120,0))","v":0},null,"mm"]
[null,"Inlet diameter",null,null,{"$f":"INDEX(I$72:I$120,MATCH(D139,B$72:B$120,0))","v":16},null,null,{"$f":"INDEX(I$72:I$120,MATCH(F139,B$72:B$120,0))","v":22},null,null,{"$f":"INDEX(I$72:I$120,MATCH(H139,B$72:B$120,0))","v":0},null,"mm"]
[null,"Pressure drop",null,null,{"$f":"INDEX(K$72:K$120,MATCH(D139,B$72:B$120,0))","v":0.8016477500000001},null,null,{"$f":"INDEX(K$72:K$120,MATCH(F139,B$72:B$120,0))","v":1.066897},null,null,{"$f":"INDEX(K$72:K$120,MATCH(H139,B$72:B$120,0))","v":0},null,"bar"]
[null,"Flow on prism",null,null,{"$f":"ROUND(Metric!$C$139,1)","v":2.4},null,null,{"$f":"ROUND(Metric!$E$139,1)","v":3.1},null,null,{"$f":"ROUND(Metric!$G$139,1)","v":9000},null,"m/s"]
[]
[]
[]
[null,"Disclaimer: The values represented here should be only considered as a rule of thumb. They are only estimates with water at 20 °C (68 °F). In real life applications the applicable flow rates can differ by features of chosen liquid (concentration, viscosity etc.). For example, black liquor rarely can exceed 0.5 m/s velocities due to high viscosity, and high velocities with high concentration sulphuric acid can increase corrosion. Moreover, individual conditions of the installation site can affect the flow cell selection (proximity to other equipment and/or pipe bends, temperature)"]
[]
[null,"Flow Calculator:"]
[]
[null,"Flow Calculator"]
[]
[null,null,"Flow cell inlet diameter ",null,null,1,"inch","Flow cell inlet diameter ",null,null,4,"mm"]
[null,null,"Flow rate Q",null,null,20,"GPM","Velocity v",null,null,5,"m/s"]
[null,null,"Velocity v",null,null,{"$f":"0.003785411784*F64/((0.001*0.5*25.4*F63)^2*PI()*60)","v":2.4902019015930317},"m/s","Flow rate Q",null,null,{"$f":"K66*0.264172052358","v":0.99590517476595719},"GPM"]
[null,null,"Velocity v",null,null,{"$f":"F65*3.28083989501","v":8.1699537453761852},"ft/s","Flow rate Q",null,null,{"$f":"K67*1000/60","v":3.7699111843077517},"l/min"]
[null,null,null,null,null,null,null,"Flow rate Q",null,null,{"$f":"(K64*9*PI()*(K63)^2)/10000","v":0.22619467105846511},"m3/h"]
[]
[null,"List All Flow Cells:"]
[null,"Model",null,null,null,"PR-Model",null,"Pipe size","Inlet diameter"," Flow on prism","Pressure loss ","Max velocity within flowcell"]
[null,null,null,null,null,null,null,"mm","mm","m/s","bar","m/s"]
[null,"PMFC-HSS-H04",null,null,null,"PR-23-A/PR-43-A",null,12.7,4,{"$f":"IF(Data!L90<0,0,Data!L90)","v":256.04436500000003},{"$f":"IF(Data!O90<0,0,Data!O90)","v":75.472637750000004},{"$f":"IF(Data!R90<0,0,Data!R90)","v":126.54320000000001},{"$f":"J72","v":256.04436500000003},{"$f":"IF(L72>6,\"Max velocity over 6 m/s, risk of cavitation\", \" \")","v":"Max velocity over 6 m/s, risk of cavitation"},null,null,{"$f":"B124","v":2.4},"0 - 0.75 m/s"]
[null,"PMFC-HSS-H05",null,null,null,"PR-23-A/PR-43-A",null,12.7,5,{"$f":"IF(Data!L95<0,0,Data!L95)","v":37.733450000000005},{"$f":"IF(Data!O95<0,0,Data!O95)","v":22.23876675},{"$f":"IF(Data!R95<0,0,Data!R95)","v":71.787011000000007},{"$f":"J73","v":37.733450000000005},{"$f":"IF(L73>6,\"Max velocity over 6 m/s, risk of cavitation\", \" \")","v":"Max velocity over 6 m/s, risk of cavitation"},null,null,{"$f":"B125","v":4},"0.75 - 1.5 m/s"]
[null,"PMFC-HSS-H06",null,null,null,"PR-23-A/PR-43-A",null,12.7,6,{"$f":"IF(Data!L100<0,0,Data!L100)","v":29.063419175000003},{"$f":"IF(Data!O100<0,0,Data!O100)","v":7.5943767500000003},{"$f":"IF(Data!R100<0,0,Data!R100)","v":53.955824499999999},{"$f":"J74","v":29.063419175000003},"Max velocity over 6 m/s, risk of cavitation",null,null,{"$f":"B126","v":16.399999999999999},"1.5 - 5 m/s"]
[null,"AFC-HSS-H10-SI (-NC-SN/WNWP-PG)",null,null,null,"PR-23-A/PR-43-A",null,25.4,22.6,{"$f":"IF(Data!L10<0,0,Data!L10)","v":1.4319300000000001},{"$f":"IF(Data!O10<0,0,Data!O10)","v":2.6992500000000003E-2},{"$f":"IF(Data!R10<0,0,Data!R10)","v":3.2569917500000005},{"$f":"J75","v":1.4319300000000001}," ",null,null,{"$f":"B127","v":18},"5 - 6 m/s"]
[null,"AFC-HSS-H10-RI (-NC-SN/WNWP-PG) ",null,null,null,"PR-23-A/PR-43-A",null,25.4,22.6,{"$f":"IF(Data!L5<0,0,Data!L5)","v":1.7900600000000002},{"$f":"IF(Data!O5<0,0,Data!O5)","v":6.4162500000000011E-2},{"$f":"IF(Data!R5<0,0,Data!R5)","v":4.8477645000000003},1.7900600000000002," ",null,null,{"$f":"B128","v":21},"over 6 m/s"]
[null,"AFC-HSS-H15-SI (-NC-SN/WNWP-PG)",null,null,null,"PR-23-A/PR-43-A",null,{"$f":"1.5*25.4","v":38.099999999999994},35.6,{"$f":"IF(Data!L20<0,0,Data!L20)","v":0.78984775000000007},{"$f":"IF(Data!O20<0,0,Data!O20)","v":3.7612499999999998E-3},{"$f":"IF(Data!R20<0,0,Data!R20)","v":1.3853642500000001},0.78984775000000007," "]
[null,"AFC-HSS-H15-RI (-NC-SN/WNWP-PG) ",null,null,null,"PR-23-A/PR-43-A",null,{"$f":"1.5*25.4","v":38.099999999999994},35.6,{"$f":"IF(Data!L15<0,0,Data!L15)","v":1.1952072500000002},{"$f":"IF(Data!O15<0,0,Data!O15)","v":1.6254500000000002E-2},{"$f":"IF(Data!R15<0,0,Data!R15)","v":2.3199684999999999},1.1952072500000002," "]
[null,"AFC-HSS-H20-SI (-NC-SN/WNWP-PG) ",null,null,null,"PR-23-A/PR-43-A",null,{"$f":"50.8","v":50.8},48.6,{"$f":"IF(Data!L30<0,0,Data!L30)","v":0.29441000000000001},{"$f":"IF(Data!O30<0,0,Data!O30)","v":1.1652500000000001E-3},{"$f":"IF(Data!R30<0,0,Data!R30)","v":1.1067190500000001},0.29441000000000001," "]
[null,"AFC-HSS-H20-RI (-NC-SN/WNWP-PG)",null,null,null,"PR-23-A/PR-43-A",null,{"$f":"50.8","v":50.8},48.6,{"$f":"IF(Data!L25<0,0,Data!L25)","v":0.58238310000000004},{"$f":"IF(Data!O25<0,0,Data!O25)","v":3.6580000000000007E-3},{"$f":"IF(Data!R25<0,0,Data!R25)","v":1.1610905},0.58238310000000004," "]
[null,"AFC-HSS-H25-SI (-NC-SN/WNWP-PG) ",null,null,null,"PR-23-A/PR-43-A",null,{"$f":"63.5","v":63.5},60.3,{"$f":"IF(Data!L35<0,0,Data!L35)","v":0.18201500000000001},{"$f":"IF(Data!O35<0,0,Data!O35)","v":3.4957500000000008E-4},{"$f":"IF(Data!R35<0,0,Data!R35)","v":0.60206107500000006},0.18201500000000001," "]
[null,"AFC-HSS-H30-SI (-NC-SN/WNWP-PG)",null,null,null,"PR-23-A/PR-43-A",null,{"$f":"76.2","v":76.2},72.8,{"$f":"IF(Data!L40<0,0,Data!L40)","v":0.14753481000000002},{"$f":"IF(Data!O40<0,0,Data!O40)","v":8.5107500000000018E-5},{"$f":"IF(Data!R40<0,0,Data!R40)","v":0.24042500000000003},0.14753481000000002," "]
[null,"AFC-HSS-H40-SI (-NC-SN/WNWP-PG)",null,null,null,"PR-23-A/PR-43-A",null,{"$f":"101.6","v":101.6},97.6,{"$f":"IF(Data!L45<0,0,Data!L45)","v":7.2882404999999997E-2},{"$f":"IF(Data!O45<0,0,Data!O45)","v":3.6462000000000004E-5},{"$f":"IF(Data!R45<0,0,Data!R45)","v":0.13216},7.2882404999999997E-2," "]
[null,"SFC-HHSS-H10-90",null,null,null,"PR-23-A/PR-43-A",null,25.4,22.6,{"$f":"IF(Data!L50<0,0,Data!L50)","v":0.41477000000000003},{"$f":"IF(Data!O50<0,0,Data!O50)","v":3.0517750000000003E-2},{"$f":"IF(Data!R50<0,0,Data!R50)","v":2.7083065000000004},0.41477000000000003," "]
[null,"SFC-HHSS-H10-180",null,null,null,"PR-23-A/PR-43-A",null,25.4,22.6,{"$f":"IF(Data!L55<0,0,Data!L55)","v":0.26520500000000002},{"$f":"IF(Data!O55<0,0,Data!O55)","v":2.0635250000000001E-2},{"$f":"IF(Data!R55<0,0,Data!R55)","v":2.6816283224999999},0.26520500000000002," "]
[null,"SFC-HHSS-H15-90",null,null,null,"PR-23-A/PR-43-A",null,{"$f":"1.5*25.4","v":38.099999999999994},35.6,{"$f":"IF(Data!L60<0,0,Data!L60)","v":0.267565},{"$f":"IF(Data!O60<0,0,Data!O60)","v":0},{"$f":"IF(Data!R60<0,0,Data!R60)","v":1.0602152499999999},0.267565," "]
[null,"SFC-HHSS-H15-180",null,null,null,"PR-23-A/PR-43-A",null,{"$f":"1.5*25.4","v":38.099999999999994},35.6,{"$f":"IF(Data!L65<0,0,Data!L65)","v":0.14455000000000001},{"$f":"IF(Data!O65<0,0,Data!O65)","v":2.5222499999999998E-3},{"$f":"IF(Data!R65<0,0,Data!R65)","v":1.0655400000000002},0.14455000000000001," "]
[null,"SFC-HHSS-H20-90",null,null,null,"PR-23-A/PR-43-A",null,{"$f":"50.8","v":50.8},48.6,{"$f":"IF(Data!L70<0,0,Data!L70)","v":0.22489620000000002},{"$f":"IF(Data!O70<0,0,Data!O70)","v":1.6225000000000002E-3},{"$f":"IF(Data!R70<0,0,Data!R70)","v":0.79853107500000009},0.22489620000000002," "]
[null,"SFC-HHSS-H20-180",null,null,null,"PR-23-A/PR-43-A",null,{"$f":"50.8","v":50.8},48.6,{"$f":"IF(Data!L75<0,0,Data!L75)","v":8.7615000000000012E-2},{"$f":"IF(Data!O75<0,0,Data!O75)","v":0},{"$f":"IF(Data!R75<0,0,Data!R75)","v":0.59000000000000008},8.7615000000000012E-2," "]
[null,"SFC-HHSS-H25-90",null,null,null,"PR-23-A/PR-43-A",null,{"$f":"63.5","v":63.5},60.3,{"$f":"IF(Data!L80<0,0,Data!L80)","v":9.4192024999999999E-2},{"$f":"IF(Data!O80<0,0,Data!O80)","v":4.6315000000000006E-4},{"$f":"IF(Data!R80<0,0,Data!R80)","v":0.49445481000000002},9.4192024999999999E-2," "]
[null,"SFC-HHSS-H25-180",null,null,null,"PR-23-A/PR-43-A",null,{"$f":"63.5","v":63.5},60.3,{"$f":"IF(Data!L85<0,0,Data!L85)","v":0.16232832250000001},{"$f":"IF(Data!O85<0,0,Data!O85)","v":1.5635000000000003E-4},{"$f":"IF(Data!R85<0,0,Data!R85)","v":0.36845500000000003},0.16232832250000001," "]
[null,"PR-33-S (1/4\") F2-025\n",null,null,null,"PR-33-S/PR-23-MS",null,{"$f":"6.35","v":6.35},4,{"$f":"IF(Data!L105<0,0,Data!L105)","v":36.187074750000001},{"$f":"IF(Data!O105<0,0,Data!O105)","v":56.830614250000004},{"$f":"IF(Data!R105<0,0,Data!R105)","v":98.790234250000012},36.187074750000001,"Max velocity over 6 m/s, risk of cavitation"]
[null,"PR-33-S (3/8\") F2-038",null,null,null,"PR-33-S/PR-23-MS",null,{"$f":"9.5","v":9.5},6.5,{"$f":"IF(Data!L125<0,0,Data!L125)","v":18.349885},{"$f":"IF(Data!O125<0,0,Data!O125)","v":10.049396250000001},{"$f":"IF(Data!R125<0,0,Data!R125)","v":44.482754999999997},18.349885,"Max velocity over 6 m/s, risk of cavitation"]
[null,"PR-33-S (1/2\") F2-050",null,null,null,"PR-33-S/PR-23-MS",null,{"$f":"12.7","v":12.7},11,{"$f":"IF(Data!L110<0,0,Data!L110)","v":6.2546047499999995},{"$f":"IF(Data!O110<0,0,Data!O110)","v":3.5975692500000003},{"$f":"IF(Data!R110<0,0,Data!R110)","v":30.135592250000002},6.2546047499999995,"Max velocity over 6 m/s, risk of cavitation"]
[null,"PR-33-S (3/4\") F2-075",null,null,null,"PR-33-S/PR-23-MS",null,{"$f":"19.05","v":19.05},16,{"$f":"IF(Data!L115<0,0,Data!L115)","v":2.3875087500000003},{"$f":"IF(Data!O115<0,0,Data!O115)","v":0.8016477500000001},{"$f":"IF(Data!R115<0,0,Data!R115)","v":15.84101325},2.3875087500000003,"Max velocity over 6 m/s, risk of cavitation"]
[null,"PR-33-S (1\") F2-100",null,null,null,"PR-33-S/PR-23-MS",null,25.4,22,{"$f":"IF(Data!L120<0,0,Data!L120)","v":3.0535597500000002},{"$f":"IF(Data!O120<0,0,Data!O120)","v":1.066897},{"$f":"IF(Data!R120<0,0,Data!R120)","v":16.978503750000002},3.0535597500000002,"Max velocity over 6 m/s, risk of cavitation"]
[null,"WFC-KSS-A/D/J-05-NC-SN/WNWP/PG",null,null,null,"PR-23-GC",null,{"$f":"0.5*25.4","v":12.7},{"$f":"8.65*2","v":17.3},{"$f":"IF(Data!L130<0,0,Data!L130)","v":3.3246205000000004},{"$f":"IF(Data!O130<0,0,Data!O130)","v":0.21712000000000001},{"$f":"IF(Data!R130<0,0,Data!R130)","v":8.2269895000000002},3.3246205000000004,"Max velocity over 6 m/s, risk of cavitation"]
[null,"WFC-KSS-A/D/J-10-NC-SN/WNWP/PG",null,null,null,"PR-23-GC",null,{"$f":"1*25.4","v":25.4},{"$f":"2*13.35","v":26.7},{"$f":"IF(Data!L135<0,0,Data!L135)","v":1.4718582499999999},{"$f":"IF(Data!O135<0,0,Data!O135)","v":7.5165999999999997E-2},{"$f":"IF(Data!R135<0,0,Data!R135)","v":4.3782425000000007},1.4718582499999999," "]
[null,"WFC-KSS-A/D/J-15-NC-SN/WNWP/PG",null,null,null,"PR-23-GC",null,{"$f":"1.5*25.4","v":38.099999999999994},40.9,{"$f":"IF(Data!L140<0,0,Data!L140)","v":0.52655582499999998},{"$f":"IF(Data!O125<0,0,Data!O125)","v":10.049396250000001},{"$f":"IF(Data!R125<0,0,Data!R125)","v":44.482754999999997},0.52655582499999998,"Max velocity over 6 m/s, risk of cavitation"]
[null,"GFC-K60-P40-SS-J15-P10",null,null,null,"PR-23-GC",null,{"$f":"1*25.4","v":25.4},{"$f":"4.7*2","v":9.4},{"$f":"IF(Data!L145<0,0,Data!L145)","v":9.2418927499999999},{"$f":"IF(Data!O145<0,0,Data!O145)","v":3.4724154999999999},{"$f":"IF(Data!R145<0,0,Data!R145)","v":17.49298375},9.2418927499999999,"Max velocity over 6 m/s, risk of cavitation"]
[null,"GFC-K60-P40-SS-R05/N05/A05/D15-PXX-SN/WN/WP-PG",null,null,null,"PR-23-GC",null,{"$f":"0.5*25.4","v":12.7},{"$f":"2*5.97","v":11.94},{"$f":"IF(Data!L150<0,0,Data!L150)","v":8.6715102500000025},{"$f":"IF(Data!O150<0,0,Data!O150)","v":2.6677145000000002},{"$f":"IF(Data!R150<0,0,Data!R150)","v":18.443385250000002},8.6715102500000025,"Max velocity over 6 m/s, risk of cavitation"]
[null,"GFC-K60-P40-SS-R10/N10/A10/D25-PXX-SN/WN/WP-PG",null,null,null,"PR-23-GC",null,{"$f":"1*25.4","v":25.4},{"$f":"2*11.18","v":22.36},{"$f":"IF(Data!L155<0,0,Data!L155)","v":1.9814117500000004},{"$f":"IF(Data!O155<0,0,Data!O155)","v":0.17770799999999998},{"$f":"IF(Data!R155<0,0,Data!R155)","v":6.0452580000000005},1.9814117500000004,"Max velocity over 6 m/s, risk of cavitation"]
[null,"GFC-K60-P40-SS-D15-P40",null,null,null,"PR-23-GC",null,38.1,9.5,{"$f":"IF(Data!L160<0,0,Data!L160)","v":10.81763525},{"$f":"IF(Data!O160<0,0,Data!O160)","v":4.1218727500000005},{"$f":"IF(Data!R160<0,0,Data!R160)","v":18.960771000000001},10.81763525,"Max velocity over 6 m/s, risk of cavitation"]
[null,"GFC-K60-P40-SS-D25-P40",null,null,null,"PR-23-GC",null,{"$f":"2.5*25.4","v":63.5},{"$f":"2*7.5","v":15},{"$f":"IF(Data!L165<0,0,Data!L165)","v":1.9114672500000001},{"$f":"IF(Data!O165<0,0,Data!O165)","v":0.32184499999999999},{"$f":"IF(Data!R165<0,0,Data!R165)","v":8.9509195000000012},1.9114672500000001,"Max velocity over 6 m/s, risk of cavitation"]
[null,"PFC-KSS-A10",null,null,null,"PR-23-GP",null,{"$f":"1*25.4","v":25.4},{"$f":"2*13.47","v":26.94},{"$f":"IF(Data!L170<0,0,Data!L170)","v":2.211792},{"$f":"IF(Data!O170<0,0,Data!O170)","v":5.3970250000000004E-2},{"$f":"IF(Data!R170<0,0,Data!R170)","v":3.7111590000000003},2.211792," "]
[null,"PFC-23GP-A/D/J-SS-A10/D10/J10",null,null,null,"PR-23-GP",null,{"$f":"1*25.4","v":25.4},{"$f":"2*26.3","v":52.6},{"$f":"IF(Data!L175<0,0,Data!L175)","v":0.31240499999999999},{"$f":"IF(Data!O175<0,0,Data!O175)","v":6.9767500000000003E-4},{"$f":"IF(Data!R175<0,0,Data!R175)","v":0.5401450000000001},0.31240499999999999," "]
[null,"PFC-23GP-A/D/J-SS-A15/D15/J15",null,null,null,"PR-23-GP",null,{"$f":"1.5*25.4","v":38.099999999999994},50,{"$f":"IF(Data!L180<0,0,Data!L180)","v":0.32568000000000003},{"$f":"IF(Data!O180<0,0,Data!O180)","v":8.1567499999999997E-4},{"$f":"IF(Data!R180<0,0,Data!R180)","v":0.55028120000000003},0.32568000000000003," "]
[null,"SVB-A020/D050-GC-PFA/ETF",null,null,null,"PR-23-W2",null,{"$f":"2*25.4","v":50.8},46,{"$f":"IF(Data!L185<0,0,Data!L185)","v":4.2480000000000004E-2},{"$f":"IF(Data!O185<0,0,Data!O185)","v":5.9000000000000003E-4},{"$f":"IF(Data!R185<0,0,Data!R185)","v":1.231625},4.2480000000000004E-2," "]
[null,"SVB-A030/D050-GC-PFA/ETF",null,null,null,"PR-23-W3",null,{"$f":"76.2","v":76.2},70,{"$f":"IF(Data!L190<0,0,Data!L190)","v":1.9175000000000001E-2},{"$f":"IF(Data!O190<0,0,Data!O190)","v":5.9000000000000003E-4},{"$f":"IF(Data!R190<0,0,Data!R190)","v":0.68617000000000006},1.9175000000000001E-2," "]
[null,"SVB-A040/D050-GC-PFA/ETF",null,null,null,"PR-23-W4",null,{"$f":"101.6","v":101.6},90,{"$f":"IF(Data!L195<0,0,Data!L195)","v":1.0030000000000001E-2},{"$f":"IF(Data!O195<0,0,Data!O195)","v":8.850000000000001E-5},{"$f":"IF(Data!R195<0,0,Data!R195)","v":0.34485500000000002},1.0030000000000001E-2," "]
[null,"FTC-SS-A05/D10/J10",null,null,null,"PR-43-GP",null,{"$f":"0.5*25.4","v":12.7},26.7,{"$f":"IF(Data!L200<0,0,Data!L200)","v":1.164955},{"$f":"IF(Data!O200<0,0,Data!O200)","v":8.8499999999999994E-4},{"$f":"IF(Data!R200<0,0,Data!R200)","v":1.9449350000000001},1.164955," "]
[null,"FTC-SS-A10/D10/J10",null,null,null,"PR-43-GP",null,{"$f":"1*25.4","v":25.4},{"$f":"2*12.4","v":24.8},{"$f":"IF(Data!L205<0,0,Data!L205)","v":1.1903250000000001},{"$f":"IF(Data!O205<0,0,Data!O205)","v":2.065E-3},{"$f":"IF(Data!R205<0,0,Data!R205)","v":2.2387550000000003},1.1903250000000001," "]
[null,"FTC-SS-A15/D15/J15",null,null,null,"PR-43-GP",null,{"$f":"1.5*25.4","v":38.099999999999994},40.9,{"$f":"IF(Data!L210<0,0,Data!L210)","v":0.47731000000000001},{"$f":"IF(Data!O210<0,0,Data!O210)","v":2.9500000000000001E-4},{"$f":"IF(Data!R210<0,0,Data!R210)","v":0.83308000000000004},0.47731000000000001," "]
[null,"FTC-SS-A20/D20/J20",null,null,null,"PR-43-GP",null,50.8,{"$f":"2*26.3","v":52.6},{"$f":"IF(Data!L215<0,0,Data!L215)","v":0.26962999999999998},{"$f":"IF(Data!O215<0,0,Data!O215)","v":1.7700000000000002E-4},{"$f":"IF(Data!R215<0,0,Data!R215)","v":0.46403500000000003},0.26962999999999998," "]
[null,"CFC-RP-M20-M10-NC-PG/SN/WP",null,null,null,"PR-23-RP",null,{"$f":"1*25.4","v":25.4},26.7,{"$f":"IF(Data!L220<0,0,Data!L220)","v":1.3735200000000001},{"$f":"IF(Data!O220<0,0,Data!O220)","v":4.3660000000000001E-3},{"$f":"IF(Data!R220<0,0,Data!R220)","v":1.77885},1.3735200000000001," "]
[null,"CFC-RP-M20-M20-NC-PG/SN/WP",null,null,null,"PR-23-RP",null,{"$f":"2*25.4","v":50.8},{"$f":"2*26.3","v":52.6},{"$f":"IF(Data!L225<0,0,Data!L225)","v":0.45430000000000004},{"$f":"IF(Data!O225<0,0,Data!O225)","v":1.4750000000000001E-4},{"$f":"IF(Data!R225<0,0,Data!R225)","v":0.55459999999999998},0.45430000000000004," "]
[]
[]
[null,"Out of range",null,null,null,null,null,null,null,0]
[null,"Out of range",null,null,null,null,null,0,0,9000,0,0]
[]
[]
[]
[null,2.4,null,null,null,null,null,null,null,"0 - 0.75 m/s",1,null,"A-P:n teoria:",null,"Putkikoon muuttaminen tuumiin"]
[null,4,null,null,null,null,null,null,null,"0.75 - 1.5 m/s",2,12.7,0.5]
[null,16.399999999999999,null,null,null,null,null,null,null,"1.5 - 5 m/s",3,25.4,1,null,{"$f":"J9","v":25.4}]
[null,18,null,null,null,null,{"$f":"((9*(23)^2*PI())*1.5)/10000","v":2.243568393561151},null,null,"5 - 6 m/s",4,38.1,1.5,null,{"$f":"O126/25.4","v":1}]
[null,21,null,null,null,null,null,null,null,"over 6 m/s",5,50.8,2]
[null,null,null,null,null,null,null,null,null,null,null,63.5,2.5]
[null,null,null,null,null,null,{"$f":"IF(F9=\"Out of range\",0,F8)","v":0},null,null,null,null,76.2,3]
[null,"recommended velocity",null,{"$f":"1.85","v":1.85},null,"velocity m^3/h",{"$f":"IF(F10=\"Out of range\",0,F9)","v":2.95},null,null,null,null,101.6,4]
[]
[null,null,null,null,null,null,null,null,6,{"$f":"IF(I133>=6,1,IF(I133>=5,2,IF(I133>=1.5,3,IF(I133>=0.75,2,1))))","v":1}]
[null,null,null,null,null,null,null,null,null,null,null,null,{"$f":"INDEX(M125:M131,MATCH(MIN(ABS(M125:M131-O127)),ABS(M125:M131-O127),0))","v":1}]
[]
[null,"Uusi käytännöllinen tuotteen valinta"]
[null,"Chemical industry",1.9814117500000004,{"$f":"INDEX(B$72:B$120,MATCH(C$137,J$72:J$120,0))","v":"GFC-K60-P40-SS-R10/N10/A10/D25-PXX-SN/WN/WP-PG"},2.211792,{"$f":"INDEX(B$72:B$120,MATCH(E$137,J$72:J$120,0))","v":"PFC-KSS-A10"},1.4718582499999999,{"$f":"INDEX(B$72:B$120,MATCH(G$137,J$72:J$120,0))","v":"WFC-KSS-A/D/J-10-NC-SN/WNWP/PG"}]
[null,"Food Industry",1.7900600000000002,{"$f":"INDEX(B$72:B$120,MATCH(C$138,J$72:J$120,0))","v":"AFC-HSS-H10-RI (-NC-SN/WNWP-PG) "},1.4319300000000001,{"$f":"INDEX(B$72:B$120,MATCH(E$138,J$72:J$120,0))","v":"AFC-HSS-H10-SI (-NC-SN/WNWP-PG)"},0.41477000000000003,{"$f":"INDEX(B$72:B$120,MATCH(G$138,J$72:J$120,0))","v":"SFC-HHSS-H10-90"}]
[null,"Semiconductor",2.3875087500000003,{"$f":"INDEX(B$72:B$120,MATCH(C$139,J$72:J$120,0))","v":"PR-33-S (3/4\") F2-075"},3.0535597500000002,{"$f":"INDEX(B$72:B$120,MATCH(E$139,J$72:J$120,0))","v":"PR-33-S (1\") F2-100"},9000,{"$f":"INDEX(B$72:B$120,MATCH(G$139,J$72:J$120,0))","v":"Out of range"}]
[]
[null,null,null,"Food Industry",null,null,null,null,null,null,"Chemical industry",null,null,null,null,null,null,"Semiconductor"]
[]
[null,null,null,"Best",null,"2nd Best",null,"3rd best",null,null,"Best",null,"2nd Best",null,"3rd best",null,null,"Best",null,"2nd Best",null,"3rd best"]
[null,"PMFC-HSS-H04",0.5,{"$f":"IF((OR(J72=0,J72>6)),9000,J72)","v":9000},{"$f":"INDEX($F$181:$F$249,MATCH(D144,$E$181:$E$249,1))","v":0},{"$f":"IF(D144=$D$148,9000,D144)","v":9000},{"$f":"INDEX($F$181:$F$249,MATCH(F144,$E$181:$E$249,1))","v":0},{"$f":"IF(F144=$F$148,9000,F144)","v":9000},{"$f":"INDEX($F$181:$F$249,MATCH(H144,$E$181:$E$249,1))","v":0},"WFC-05",{"$f":"IF((OR(J97=0,J97>6)),9000,J97)","v":3.3246205000000004},{"$f":"INDEX($F$181:$F$249,MATCH(K144,$E$181:$E$249,1))","v":64},{"$f":"IF(K144=$K$148,9000,K144)","v":9000},{"$f":"INDEX($F$181:$F$249,MATCH(M144,$E$181:$E$249,1))","v":0},{"$f":"IF(M144=$M$148,9000,M144)","v":9000},{"$f":"INDEX($F$181:$F$249,MATCH(O144,$E$181:$E$249,1))","v":0},"PR-33-S (1/4\")\n",{"$f":"IF((OR(J92=0,J92>6)),9000,J92)","v":9000},{"$f":"INDEX($F$181:$F$249,MATCH(R144,$E$181:$E$249,1))","v":0},{"$f":"IF(R144=R148,9000,R144)","v":9000},{"$f":"INDEX($F$181:$F$249,MATCH(T144,$E$181:$E$249,1))","v":0},{"$f":"IF(T144=T148,9000,T144)","v":9000},{"$f":"INDEX($F$181:$F$249,MATCH(V144,$E$181:$E$249,1))","v":0}]
[null,"PMFC-HSS-05",null,{"$f":"IF((OR(J73=0,J73>6)),9000,J73)","v":9000},{"$f":"INDEX($F$181:$F$249,MATCH(D145,$E$181:$E$249,1))","v":0},{"$f":"IF(D145=$D$148,9000,D145)","v":9000},{"$f":"INDEX($F$181:$F$249,MATCH(F145,$E$181:$E$249,1))","v":0},{"$f":"IF(F145=$F$148,9000,F145)","v":9000},{"$f":"INDEX($F$181:$F$249,MATCH(H145,$E$181:$E$249,1))","v":0},"GFC-K60-P40-R05",{"$f":"IF((OR(J101=0,J101>6)),9000,J101)","v":9000},{"$f":"INDEX($F$181:$F$249,MATCH(K145,$E$181:$E$249,1))","v":0},{"$f":"IF(K145=$K$148,9000,K145)","v":9000},{"$f":"INDEX($F$181:$F$249,MATCH(M145,$E$181:$E$249,1))","v":0},{"$f":"IF(M145=$M$148,9000,M145)","v":9000},{"$f":"INDEX($F$181:$F$249,MATCH(O145,$E$181:$E$249,1))","v":0},"PR-33-S (1/2\")",{"$f":"IF((OR(J94=0,J94>6)),9000,J94)","v":9000},{"$f":"INDEX($F$181:$F$249,MATCH(R145,$E$181:$E$249,1))","v":0},{"$f":"IF(R145=R148,9000,R145)","v":9000},{"$f":"INDEX($F$181:$F$249,MATCH(T145,$E$181:$E$249,1))","v":0},{"$f":"IF(T145=T148,9000,T145)","v":9000},{"$f":"INDEX($F$181:$F$249,MATCH(V145,$E$181:$E$249,1))","v":0}]
[null,"PMFC-HSS-H06",null,{"$f":"IF((OR(J74=0,J74>6)),9000,J74)","v":9000},{"$f":"INDEX($F$181:$F$249,MATCH(D146,$E$181:$E$249,1))","v":0},{"$f":"IF(D146=$D$148,9000,D146)","v":9000},{"$f":"INDEX($F$181:$F$249,MATCH(F146,$E$181:$E$249,1))","v":0},{"$f":"IF(F146=$F$148,9000,F146)","v":9000},{"$f":"INDEX($F$181:$F$249,MATCH(H146,$E$181:$E$249,1))","v":0},"FTC-A05",{"$f":"IF((OR(J111=0,J111>6)),9000,J111)","v":1.164955},{"$f":"INDEX($F$181:$F$249,MATCH(K146,$E$181:$E$249,1))","v":21.449999999999996},{"$f":"IF(K146=$K$148,9000,K146)","v":1.164955},{"$f":"INDEX($F$181:$F$249,MATCH(M146,$E$181:$E$249,1))","v":21.449999999999996},{"$f":"IF(M146=$M$148,9000,M146)","v":9000},{"$f":"INDEX($F$181:$F$249,MATCH(O146,$E$181:$E$249,1))","v":0},"PR-33-S (3/4\")",{"$f":"IF((OR(J95=0,J95>6)),9000,J95)","v":2.3875087500000003},{"$f":"INDEX($F$181:$F$249,MATCH(R146,$E$181:$E$249,1))","v":84},{"$f":"IF(R146=R148,9000,R146)","v":9000},{"$f":"INDEX($F$181:$F$249,MATCH(T146,$E$181:$E$249,1))","v":0},{"$f":"IF(T146=T148,9000,T146)","v":9000},{"$f":"INDEX($F$181:$F$249,MATCH(V146,$E$181:$E$249,1))","v":0}]
[null,null,null,null,null,null,null,null,null,null,null,null,null,null,null,null,"PR-33-S (3/8\")",{"$f":"IF((OR(J93=0,J93>6)),9000,J93)","v":9000},{"$f":"INDEX($F$181:$F$249,MATCH(R147,$E$181:$E$249,1))","v":0},{"$f":"IF(R147=R148,9000,R147)","v":9000},{"$f":"INDEX($F$181:$F$249,MATCH(T147,$E$181:$E$249,1))","v":0},{"$f":"IF(T147=T148,9000,T147)","v":9000},{"$f":"INDEX($F$181:$F$249,MATCH(V147,$E$181:$E$249,1))","v":0}]
[null,null,"tulos",{"$f":"INDEX(D144:D147,MATCH(E148,E144:E147,0))","v":9000},{"$f":"MAX(E144:E147)","v":0},{"$f":"INDEX(F144:F147,MATCH(G148,G144:G147))","v":9000},{"$f":"MAX(G144:G147)","v":0},{"$f":"INDEX(H144:H147,MATCH(I148,I144:I147))","v":9000},{"$f":"MAX(I144:I147)","v":0},null,{"$f":"INDEX(K144:K146,MATCH(L148,L144:L146,0))","v":3.3246205000000004},{"$f":"MAX(L144:L147)","v":64},{"$f":"INDEX(M144:M146,MATCH(N148,N144:N146,0))","v":1.164955},{"$f":"MAX(N144:N147)","v":21.449999999999996},{"$f":"INDEX(O144:O146,MATCH(P148,P144:P146,0))","v":9000},{"$f":"MAX(P144:P147)","v":0},null,{"$f":"INDEX(R144:R147,MATCH(S148,S144:S147,0))","v":2.3875087500000003},{"$f":"MAX(S144:S147)","v":84},{"$f":"INDEX(T144:T147,MATCH(U148,U144:U147,0))","v":9000},{"$f":"MAX(U144:U147)","v":0},{"$f":"INDEX(V144:V147,MATCH(W148,W144:W147,0))","v":9000},{"$f":"MAX(W144:W147)","v":0}]
[null,"SFC-HHSS-H10-90",1,{"$f":"IF((OR(J84=0,J84>6)),9000,J84)","v":0.41477000000000003},{"$f":"INDEX($F$181:$F$249,MATCH(D149,$E$181:$E$249,1))","v":5.8499999999999961},{"$f":"IF(D149=$D$156,9000,D149)","v":0.41477000000000003},{"$f":"INDEX($F$181:$F$249,MATCH(F149,$E$181:$E$249,1))","v":5.8499999999999961},{"$f":"IF(F149=$F$156,9000,F149)","v":0.41477000000000003},{"$f":"INDEX($F$181:$F$249,MATCH(H149,$E$181:$E$249,1))","v":5.8499999999999961},"FTC-A10",{"$f":"IF((OR(J112=0,J112>6)),9000,J112)","v":1.1903250000000001},{"$f":"INDEX($F$181:$F$249,MATCH(K149,$E$181:$E$249,1))","v":21.449999999999996},{"$f":"IF(K149=$K$156,9000,K149)","v":1.1903250000000001},{"$f":"INDEX($F$181:$F$249,MATCH(M149,$E$181:$E$249,1))","v":21.449999999999996},{"$f":"IF(M149=$M$156,9000,M149)","v":1.1903250000000001},{"$f":"INDEX($F$181:$F$249,MATCH(O149,$E$181:$E$249,1))","v":21.449999999999996},"PR-33-S (3/4\")",{"$f":"IF((OR(J95=0,J95>6)),9000,J95)","v":2.3875087500000003},{"$f":"INDEX($F$181:$F$249,MATCH(R149,$E$181:$E$249,1))","v":84},{"$f":"IF(R149=$R$156,9000,R149)","v":9000},{"$f":"INDEX($F$181:$F$249,MATCH(T149,$E$181:$E$249,1))","v":0},{"$f":"IF(T149=T$156,9000,T149)","v":9000},{"$f":"INDEX($F$181:$F$249,MATCH(V149,$E$181:$E$249,1))","v":0}]
[null,"SFC-HHSS-H10-180",null,{"$f":"IF((OR(J85=0,J85>6)),9000,J85)","v":0.26520500000000002},{"$f":"INDEX($F$181:$F$249,MATCH(D150,$E$181:$E$249,1))","v":3.7499999999999956},{"$f":"IF(D150=$D$156,9000,D150)","v":0.26520500000000002},{"$f":"INDEX($F$181:$F$249,MATCH(F150,$E$181:$E$249,1))","v":3.7499999999999956},{"$f":"IF(F150=$F$156,9000,F150)","v":0.26520500000000002},{"$f":"INDEX($F$181:$F$249,MATCH(H150,$E$181:$E$249,1))","v":3.7499999999999956},"WFC-10 ",{"$f":"IF((OR(J98=0,J98>6)),9000,J98)","v":1.4718582499999999},30,1.4718582499999999,30,{"$f":"IF(M150=$M$156,9000,M150)","v":1.4718582499999999},30,"PR-33-S (1\")",{"$f":"IF((OR(J96=0,J96>6)),9000,J96)","v":3.0535597500000002},{"$f":"INDEX($F$181:$F$249,MATCH(R150,$E$181:$E$249,1))","v":70},{"$f":"IF(R150=$R$156,9000,R150)","v":3.0535597500000002},{"$f":"INDEX($F$181:$F$249,MATCH(T150,$E$181:$E$249,1))","v":70},{"$f":"IF(T150=T$156,9000,T150)","v":9000},{"$f":"INDEX($F$181:$F$249,MATCH(V150,$E$181:$E$249,1))","v":0}]
[null,"AFC-HSS-H10-SI ",null,{"$f":"IF((OR(J75=0,J75>6)),9000,J75)","v":1.4319300000000001},{"$f":"INDEX($F$181:$F$249,MATCH(D151,$E$181:$E$249,1))","v":30},{"$f":"IF(D151=$D$156,9000,D151)","v":1.4319300000000001},{"$f":"INDEX($F$181:$F$249,MATCH(F151,$E$181:$E$249,1))","v":30},{"$f":"IF(F151=$F$156,9000,F151)","v":9000},{"$f":"INDEX($F$181:$F$249,MATCH(H151,$E$181:$E$249,1))","v":0},"PFC-23-GP-A10",{"$f":"IF((OR(J106=0,J106>6)),9000,J106)","v":0.31240499999999999},4.4499999999999957,0.31240499999999999,4.4499999999999957,{"$f":"IF(M151=$M$156,9000,M151)","v":0.31240499999999999},4.4499999999999957,null,9000,{"$f":"INDEX($F$181:$F$249,MATCH(R151,$E$181:$E$249,1))","v":0},9000,{"$f":"INDEX($F$181:$F$249,MATCH(T151,$E$181:$E$249,1))","v":0},9000,{"$f":"INDEX($F$181:$F$249,MATCH(V151,$E$181:$E$249,1))","v":0}]
[null,"AFC-HSS-H10-RI ",null,{"$f":"IF((OR(J76=0,J76>6)),9000,J76)","v":1.7900600000000002},{"$f":"INDEX($F$181:$F$249,MATCH(D152,$E$181:$E$249,1))","v":96},{"$f":"IF(D152=$D$156,9000,D152)","v":9000},{"$f":"INDEX($F$181:$F$249,MATCH(F152,$E$181:$E$249,1))","v":0},{"$f":"IF(F152=$F$156,9000,F152)","v":9000},{"$f":"INDEX($F$181:$F$249,MATCH(H152,$E$181:$E$249,1))","v":0},"PFC-KSS-A10",{"$f":"IF((OR(J105=0,J105>6)),9000,J105)","v":2.211792},86,2.211792,86,{"$f":"IF(M152=$M$156,9000,M152)","v":9000},0]
[null,null,null,null,null,null,null,null,null,"CFC-M10",{"$f":"IF((OR(J115=0,J115>6)),9000,J115)","v":1.3735200000000001},27.15,1.3735200000000001,27.15,{"$f":"IF(M153=$M$156,9000,M153)","v":1.3735200000000001},27.15]
[null,null,null,null,null,null,null,null,null,"GFC-K60-P40J15-P10",{"$f":"IF((OR(J100=0,J100>6)),9000,J100)","v":9000},0,9000,0,{"$f":"IF(M154=$M$156,9000,M154)","v":9000},0]
[null,null,null,null,null,null,null,null,null,"GFC-K60-P40-R10",{"$f":"IF((OR(J102=0,J102>6)),9000,J102)","v":1.9814117500000004},92,9000,0,{"$f":"IF(M155=$M$156,9000,M155)","v":9000},0]
[null,null,"tulos",{"$f":"INDEX(D149:D152,MATCH(E156,E149:E152,0))","v":1.7900600000000002},{"$f":"MAX(E149:E152)","v":96},{"$f":"INDEX(F149:F152,MATCH(G156,G149:G152,0))","v":1.4319300000000001},{"$f":"MAX(G149:G152)","v":30},{"$f":"INDEX(H149:H152,MATCH(I156,I149:I152,0))","v":0.41477000000000003},{"$f":"MAX(I149:I152)","v":5.8499999999999961},null,{"$f":"INDEX(K149:K155,MATCH(L156,L149:L155,0))","v":1.9814117500000004},{"$f":"MAX(L149:L155)","v":92},{"$f":"INDEX(M149:M155,MATCH(N156,N149:N155,0))","v":2.211792},{"$f":"MAX(N149:N155)","v":86},{"$f":"INDEX(O149:O155,MATCH(P156,P149:P155,0))","v":1.4718582499999999},{"$f":"MAX(P149:P155)","v":30},null,{"$f":"INDEX(R149:R151,MATCH(S156,S149:S151,0))","v":2.3875087500000003},{"$f":"MAX(S149:S151)","v":84},{"$f":"INDEX(T149:T151,MATCH(U156,U149:U151,0))","v":3.0535597500000002},{"$f":"MAX(U149:U151)","v":70},{"$f":"INDEX(V149:V151,MATCH(W156,W149:W151,0))","v":9000},{"$f":"MAX(W149:W151)","v":0}]
[null,"SFC-HHSS-H15-90",1.5,{"$f":"IF((OR(J86=0,J86>6)),9000,J86)","v":0.267565},{"$f":"INDEX($F$181:$F$249,MATCH(D157,$E$181:$E$249,1))","v":3.7499999999999956},{"$f":"IF(D157=$D$161,9000,D157)","v":0.267565},{"$f":"INDEX($F$181:$F$249,MATCH(F157,$E$181:$E$249,1))","v":3.7499999999999956},{"$f":"IF(F157=$F$161,9000,F157)","v":0.267565},{"$f":"INDEX($F$181:$F$249,MATCH(H157,$E$181:$E$249,1))","v":3.7499999999999956},"FTC-A15",{"$f":"IF((OR(J113=0,J113>6)),9000,J113)","v":0.47731000000000001},{"$f":"INDEX($F$181:$F$249,MATCH(K157,$E$181:$E$249,1))","v":6.5499999999999963},{"$f":"IF(K157=$K$161,9000,K157)","v":0.47731000000000001},{"$f":"INDEX($F$181:$F$249,MATCH(M157,$E$181:$E$249,1))","v":6.5499999999999963},{"$f":"IF(M157=$M$161,9000,M157)","v":9000},{"$f":"INDEX($F$181:$F$249,MATCH(O157,$E$181:$E$249,1))","v":0},null,9000,null,9000,null,9000]
[null,"SFC-HHSS-H15-180",null,{"$f":"IF((OR(J87=0,J87>6)),9000,J87)","v":0.14455000000000001},{"$f":"INDEX($F$181:$F$249,MATCH(D158,$E$181:$E$249,1))","v":1.6499999999999952},{"$f":"IF(D158=$D$161,9000,D158)","v":0.14455000000000001},{"$f":"INDEX($F$181:$F$249,MATCH(F158,$E$181:$E$249,1))","v":1.6499999999999952},{"$f":"IF(F158=$F$161,9000,F158)","v":0.14455000000000001},{"$f":"INDEX($F$181:$F$249,MATCH(H158,$E$181:$E$249,1))","v":1.6499999999999952},"WFC-15",{"$f":"IF((OR(J99=0,J99>6)),9000,J99)","v":0.52655582499999998},{"$f":"INDEX($F$181:$F$249,MATCH(K158,$E$181:$E$249,1))","v":7.2499999999999964},{"$f":"IF(K158=$K$161,9000,K158)","v":9000},{"$f":"INDEX($F$181:$F$249,MATCH(M158,$E$181:$E$249,1))","v":0},{"$f":"IF(M158=$M$161,9000,M158)","v":9000},{"$f":"INDEX($F$181:$F$249,MATCH(O158,$E$181:$E$249,1))","v":0},null,9000,null,9000,null,9000]
[null,"AFC-HSS-H15-SI ",null,{"$f":"IF((OR(J77=0,J77>6)),9000,J77)","v":0.78984775000000007},{"$f":"INDEX($F$181:$F$249,MATCH(D159,$E$181:$E$249,1))","v":10.049999999999995},{"$f":"IF(D159=$D$161,9000,D159)","v":0.78984775000000007},{"$f":"INDEX($F$181:$F$249,MATCH(F159,$E$181:$E$249,1))","v":10.049999999999995},{"$f":"IF(F159=$F$161,9000,F159)","v":9000},{"$f":"INDEX($F$181:$F$249,MATCH(H159,$E$181:$E$249,1))","v":0},"PFC-23-GP-A15",{"$f":"IF((OR(J107=0,J107>6)),9000,J107)","v":0.32568000000000003},{"$f":"INDEX($F$181:$F$249,MATCH(K159,$E$181:$E$249,1))","v":4.4499999999999957},{"$f":"IF(K159=$K$161,9000,K159)","v":0.32568000000000003},{"$f":"INDEX($F$181:$F$249,MATCH(M159,$E$181:$E$249,1))","v":4.4499999999999957},{"$f":"IF(M159=$M$161,9000,M159)","v":0.32568000000000003},{"$f":"INDEX($F$181:$F$249,MATCH(O159,$E$181:$E$249,1))","v":4.4499999999999957},null,9000,null,9000,null,9000]
[null,"AFC-HSS-H15-RI ",null,{"$f":"IF((OR(J78=0,J78>6)),9000,J78)","v":1.1952072500000002},{"$f":"INDEX($F$181:$F$249,MATCH(D160,$E$181:$E$249,1))","v":21.449999999999996},{"$f":"IF(D160=$D$161,9000,D160)","v":9000},{"$f":"INDEX($F$181:$F$249,MATCH(F160,$E$181:$E$249,1))","v":0},{"$f":"IF(F160=$F$161,9000,F160)","v":9000},{"$f":"INDEX($F$181:$F$249,MATCH(H160,$E$181:$E$249,1))","v":0}]
[null,null,"tulos",{"$f":"INDEX(D157:D160,MATCH(E161,E157:E160,0))","v":1.1952072500000002},{"$f":"MAX(E157:E160)","v":21.449999999999996},{"$f":"INDEX(F157:F160,MATCH(G161,G157:G160,0))","v":0.78984775000000007},{"$f":"MAX(G157:G160)","v":10.049999999999995},{"$f":"INDEX(H157:H160,MATCH(I161,I157:I160,0))","v":0.267565},{"$f":"MAX(I157:I160)","v":3.7499999999999956},null,{"$f":"INDEX(K157:K159,MATCH(L161,L157:L159,0))","v":0.52655582499999998},{"$f":"MAX(L157:L159)","v":7.2499999999999964},{"$f":"INDEX(M157:M159,MATCH(N161,N157:N159,0))","v":0.47731000000000001},{"$f":"MAX(N157:N159)","v":6.5499999999999963},{"$f":"INDEX(O157:O159,MATCH(P161,P157:P159,0))","v":0.32568000000000003},{"$f":"MAX(P157:P159)","v":4.4499999999999957},null,{"$f":"INDEX(R157:R159,MATCH(MIN(ABS(R157:R159-$D$131)),ABS(R157:R159-$D$131),0))","v":9000},null,{"$f":"INDEX(T157:T159,MATCH(MIN(ABS(T157:T159-$D$131)),ABS(T157:T159-$D$131),0))","v":9000},null,{"$f":"INDEX(V157:V159,MATCH(MIN(ABS(V157:V159-$D$131)),ABS(V157:V159-$D$131),0))","v":9000}]
[null,"SFC-HHSS-H20-90",2,{"$f":"IF((OR(J88=0,J88>6)),9000,J88)","v":0.22489620000000002},{"$f":"INDEX($F$181:$F$249,MATCH(D162,$E$181:$E$249,1))","v":3.0499999999999954},{"$f":"IF(D162=$D$166,9000,D162)","v":0.22489620000000002},{"$f":"INDEX($F$181:$F$249,MATCH(F162,$E$181:$E$249,1))","v":3.0499999999999954},{"$f":"IF(F162=$F$166,9000,F162)","v":0.22489620000000002},{"$f":"INDEX($F$181:$F$249,MATCH(H162,$E$181:$E$249,1))","v":3.0499999999999954},"FTC-A20",{"$f":"IF((OR(J114=0,J114>6)),9000,J114)","v":0.26962999999999998},{"$f":"INDEX($F$181:$F$249,MATCH(K162,$E$181:$E$249,1))","v":3.7499999999999956},{"$f":"IF(K162=$K$166,9000,K162)","v":0.26962999999999998},{"$f":"INDEX($F$181:$F$249,MATCH(M162,$E$181:$E$249,1))","v":3.7499999999999956},{"$f":"IF(M162=$M$166,9000,M162)","v":9000},{"$f":"INDEX($F$181:$F$249,MATCH(O162,$E$181:$E$249,1))","v":0},null,9000,null,9000,null,9000]
[null,"SFC-HHSS-H20-180",null,{"$f":"IF((OR(J89=0,J89>6)),9000,J89)","v":8.7615000000000012E-2},{"$f":"INDEX($F$181:$F$249,MATCH(D163,$E$181:$E$249,1))","v":0.94999999999999529},{"$f":"IF(D163=$D$166,9000,D163)","v":8.7615000000000012E-2},{"$f":"INDEX($F$181:$F$249,MATCH(F163,$E$181:$E$249,1))","v":0.94999999999999529},{"$f":"IF(F163=$F$166,9000,F163)","v":8.7615000000000012E-2},{"$f":"INDEX($F$181:$F$249,MATCH(H163,$E$181:$E$249,1))","v":0.94999999999999529},"CFC-M20",{"$f":"IF((OR(J116=0,J116>6)),9000,J116)","v":0.45430000000000004},{"$f":"INDEX($F$181:$F$249,MATCH(K163,$E$181:$E$249,1))","v":6.5499999999999963},{"$f":"IF(K163=$K$166,9000,K163)","v":9000},{"$f":"INDEX($F$181:$F$249,MATCH(M163,$E$181:$E$249,1))","v":0},{"$f":"IF(M163=$M$166,9000,M163)","v":9000},{"$f":"INDEX($F$181:$F$249,MATCH(O163,$E$181:$E$249,1))","v":0},null,9000,null,9000,null,9000]
[null,"AFC-HSS-H20-SI ",null,{"$f":"IF((OR(J79=0,J79>6)),9000,J79)","v":0.29441000000000001},{"$f":"INDEX($F$181:$F$249,MATCH(D164,$E$181:$E$249,1))","v":3.7499999999999956},{"$f":"IF(D164=$D$166,9000,D164)","v":0.29441000000000001},{"$f":"INDEX($F$181:$F$249,MATCH(F164,$E$181:$E$249,1))","v":3.7499999999999956},{"$f":"IF(F164=$F$166,9000,F164)","v":9000},{"$f":"INDEX($F$181:$F$249,MATCH(H164,$E$181:$E$249,1))","v":0},"PR-23-W20",{"$f":"IF((OR(J108=0,J108>6)),9000,J108)","v":4.2480000000000004E-2},{"$f":"INDEX($F$181:$F$249,MATCH(K164,$E$181:$E$249,1))","v":0.24999999999999534},{"$f":"IF(K164=$K$166,9000,K164)","v":4.2480000000000004E-2},{"$f":"INDEX($F$181:$F$249,MATCH(M164,$E$181:$E$249,1))","v":0.24999999999999534},{"$f":"IF(M164=$M$166,9000,M164)","v":4.2480000000000004E-2},{"$f":"INDEX($F$181:$F$249,MATCH(O164,$E$181:$E$249,1))","v":0.24999999999999534},null,9000,null,9000,null,9000]
[null,"AFC-HSS-H20-RI ",null,{"$f":"IF((OR(J80=0,J80>6)),9000,J80)","v":0.58238310000000004},{"$f":"INDEX($F$181:$F$249,MATCH(D165,$E$181:$E$249,1))","v":7.9499999999999966},{"$f":"IF(D165=$D$166,9000,D165)","v":9000},{"$f":"INDEX($F$181:$F$249,MATCH(F165,$E$181:$E$249,1))","v":0},{"$f":"IF(F165=$F$166,9000,F165)","v":9000},{"$f":"INDEX($F$181:$F$249,MATCH(H165,$E$181:$E$249,1))","v":0}]
[null,null,"tulos",{"$f":"INDEX(D162:D165,MATCH(E166,E162:E165,0))","v":0.58238310000000004},{"$f":"MAX(E162:E165)","v":7.9499999999999966},{"$f":"INDEX(F162:F165,MATCH(G166,G162:G165,0))","v":0.29441000000000001},{"$f":"MAX(G162:G165)","v":3.7499999999999956},{"$f":"INDEX(H162:H165,MATCH(I166,I162:I165,0))","v":0.22489620000000002},{"$f":"MAX(I162:I165)","v":3.0499999999999954},null,{"$f":"INDEX(K162:K165,MATCH(L166,L162:L165,0))","v":0.45430000000000004},{"$f":"MAX(L162:L165)","v":6.5499999999999963},{"$f":"INDEX(M162:M165,MATCH(N166,N162:N165,0))","v":0.26962999999999998},{"$f":"MAX(N162:N165)","v":3.7499999999999956},{"$f":"INDEX(O162:O165,MATCH(P166,P162:P165,0))","v":4.2480000000000004E-2},{"$f":"MAX(P162:P165)","v":0.24999999999999534},null,{"$f":"INDEX(R161:R164,MATCH(MIN(ABS(R161:R164-$D$131)),ABS(R161:R164-$D$131),0))","v":9000},null,{"$f":"INDEX(T161:T164,MATCH(MIN(ABS(T161:T164-$D$131)),ABS(T161:T164-$D$131),0))","v":9000},null,{"$f":"INDEX(V161:V164,MATCH(MIN(ABS(V161:V164-$D$131)),ABS(V161:V164-$D$131),0))","v":9000}]
[null,"SFC-HHSS-H25-90",2.5,{"$f":"IF((OR(J90=0,J90>6)),9000,J90)","v":9.4192024999999999E-2},{"$f":"INDEX($F$181:$F$249,MATCH(D167,$E$181:$E$249,1))","v":0.94999999999999529},{"$f":"IF(D167=$D$170,9000,D167)","v":9.4192024999999999E-2},{"$f":"INDEX($F$181:$F$249,MATCH(F167,$E$181:$E$249,1))","v":0.94999999999999529},{"$f":"IF(F167=$F$170,9000,F167)","v":9.4192024999999999E-2},{"$f":"INDEX($F$181:$F$249,MATCH(H167,$E$181:$E$249,1))","v":0.94999999999999529},"GFK-K60-P40-D25",{"$f":"IF((OR(J104=0,J104>6)),9000,J104)","v":1.9114672500000001},{"$f":"INDEX($F$181:$F$249,MATCH(K167,$E$181:$E$249,1))","v":92},{"$f":"IF(K167=$K$170,9000,K167)","v":9000},{"$f":"INDEX($F$181:$F$249,MATCH(M167,$E$181:$E$249,1))","v":0},{"$f":"IF(M167=$M$170,9000,M167)","v":9000},{"$f":"INDEX($F$181:$F$249,MATCH(O167,$E$181:$E$249,1))","v":0},null,9000,null,9000,null,9000]
[null,"SFC-HHSS-H25-180",null,{"$f":"IF((OR(J91=0,J91>6)),9000,J91)","v":0.16232832250000001},{"$f":"INDEX($F$181:$F$249,MATCH(D168,$E$181:$E$249,1))","v":2.3499999999999952},{"$f":"IF(D168=$D$170,9000,D168)","v":9000},{"$f":"INDEX($F$181:$F$249,MATCH(F168,$E$181:$E$249,1))","v":0},{"$f":"IF(F168=$F$170,9000,F168)","v":9000},{"$f":"INDEX($F$181:$F$249,MATCH(H168,$E$181:$E$249,1))","v":0},null,9000,{"$f":"INDEX($F$181:$F$249,MATCH(K168,$E$181:$E$249,1))","v":0},9000,{"$f":"INDEX($F$181:$F$249,MATCH(M168,$E$181:$E$249,1))","v":0},9000,{"$f":"INDEX($F$181:$F$249,MATCH(O168,$E$181:$E$249,1))","v":0},null,9000,null,9000,null,9000]
[null,"AFC-HSS-H25-SI ",null,{"$f":"IF((OR(J81=0,J81>6)),9000,J81)","v":0.18201500000000001},{"$f":"INDEX($F$181:$F$249,MATCH(D169,$E$181:$E$249,1))","v":2.3499999999999952},{"$f":"IF(D169=$D$170,9000,D169)","v":0.18201500000000001},{"$f":"INDEX($F$181:$F$249,MATCH(F169,$E$181:$E$249,1))","v":2.3499999999999952},{"$f":"IF(F169=$F$170,9000,F169)","v":9000},{"$f":"INDEX($F$181:$F$249,MATCH(H169,$E$181:$E$249,1))","v":0},null,9000,{"$f":"INDEX($F$181:$F$249,MATCH(K169,$E$181:$E$249,1))","v":0},9000,{"$f":"INDEX($F$181:$F$249,MATCH(M169,$E$181:$E$249,1))","v":0},9000,{"$f":"INDEX($F$181:$F$249,MATCH(O169,$E$181:$E$249,1))","v":0},null,9000,null,9000,null,9000]
[null,null,"tulos",{"$f":"INDEX(D167:D169,MATCH(E170,E167:E169,0))","v":0.16232832250000001},{"$f":"MAX(E167:E169)","v":2.3499999999999952},{"$f":"INDEX(F167:F169,MATCH(G170,G167:G169,0))","v":0.18201500000000001},{"$f":"MAX(G167:G169)","v":2.3499999999999952},{"$f":"INDEX(H167:H169,MATCH(I170,I167:I169,0))","v":9.4192024999999999E-2},{"$f":"MAX(I167:I169)","v":0.94999999999999529},null,{"$f":"INDEX(K167:K169,MATCH(L170,L167:L169,0))","v":1.9114672500000001},{"$f":"MAX(L167:L169)","v":92},{"$f":"INDEX(M167:M169,MATCH(N170,N167:N169,0))","v":9000},{"$f":"MAX(N167:N169)","v":0},{"$f":"INDEX(O167:O169,MATCH(P170,P167:P169,0))","v":9000},{"$f":"MAX(P167:P169)","v":0},null,{"$f":"INDEX(R167:R169,MATCH(MIN(ABS(R167:R169-$D$131)),ABS(R167:R169-$D$131),0))","v":9000},null,{"$f":"INDEX(T167:T169,MATCH(MIN(ABS(T167:T169-$D$131)),ABS(T167:T169-$D$131),0))","v":9000},null,{"$f":"INDEX(V167:V169,MATCH(MIN(ABS(V167:V169-$D$131)),ABS(V167:V169-$D$131),0))","v":9000}]
[null,"AFC-HSS-H30-SI",3,{"$f":"IF((OR(J82=0,J82>6)),9000,J82)","v":0.14753481000000002},{"$f":"INDEX($F$181:$F$249,MATCH(D171,$E$181:$E$249,1))","v":1.6499999999999952},{"$f":"IF(D171=$D$174,9000,D171)","v":9000},{"$f":"INDEX($F$181:$F$249,MATCH(F171,$E$181:$E$249,1))","v":0},{"$f":"IF(F171=$F$174,9000,F171)","v":9000},{"$f":"INDEX($F$181:$F$249,MATCH(H171,$E$181:$E$249,1))","v":0},"PR-23-W30",{"$f":"IF((OR(J109=0,J109>6)),9000,J109)","v":1.9175000000000001E-2},{"$f":"INDEX($F$181:$F$249,MATCH(K171,$E$181:$E$249,1))","v":0.24999999999999534},{"$f":"IF(K171=$K$174,9000,K171)","v":9000},{"$f":"INDEX($F$181:$F$249,MATCH(M171,$E$181:$E$249,1))","v":0},{"$f":"IF(M171=$M$174,9000,M171)","v":9000},{"$f":"INDEX($F$181:$F$249,MATCH(O171,$E$181:$E$249,1))","v":0},null,9000,null,9000,null,9000]
[null,null,null,9000,{"$f":"INDEX($F$181:$F$249,MATCH(D172,$E$181:$E$249,1))","v":0},9000,{"$f":"INDEX($F$181:$F$249,MATCH(F172,$E$181:$E$249,1))","v":0},9000,{"$f":"INDEX($F$181:$F$249,MATCH(H172,$E$181:$E$249,1))","v":0},null,9000,{"$f":"INDEX($F$181:$F$249,MATCH(K172,$E$181:$E$249,1))","v":0},9000,{"$f":"INDEX($F$181:$F$249,MATCH(M172,$E$181:$E$249,1))","v":0},9000,{"$f":"INDEX($F$181:$F$249,MATCH(O172,$E$181:$E$249,1))","v":0},null,9000,null,9000,null,9000]
[null,null,null,9000,{"$f":"INDEX($F$181:$F$249,MATCH(D173,$E$181:$E$249,1))","v":0},9000,{"$f":"INDEX($F$181:$F$249,MATCH(F173,$E$181:$E$249,1))","v":0},9000,{"$f":"INDEX($F$181:$F$249,MATCH(H173,$E$181:$E$249,1))","v":0},null,9000,{"$f":"INDEX($F$181:$F$249,MATCH(K173,$E$181:$E$249,1))","v":0},9000,{"$f":"INDEX($F$181:$F$249,MATCH(M173,$E$181:$E$249,1))","v":0},9000,{"$f":"INDEX($F$181:$F$249,MATCH(O173,$E$181:$E$249,1))","v":0},null,9000,null,9000,null,9000]
[null,null,"tulos",{"$f":"INDEX(D171:D173,MATCH(E174,E171:E173,0))","v":0.14753481000000002},{"$f":"MAX(E171:E173)","v":1.6499999999999952},{"$f":"INDEX(F167:F170,MATCH(G174,G167:G170,0))","v":9000},{"$f":"MAX(G171:G173)","v":0},{"$f":"INDEX(H167:H170,MATCH(I174,I167:I170,0))","v":9000},{"$f":"MAX(I171:I173)","v":0},null,{"$f":"INDEX(K171:K173,MATCH(L174,L171:L173,0))","v":1.9175000000000001E-2},{"$f":"MAX(L171:L173)","v":0.24999999999999534},{"$f":"INDEX(M171:M173,MATCH(N174,N171:N173,0))","v":9000},{"$f":"MAX(N171:N173)","v":0},{"$f":"INDEX(O171:O173,MATCH(P174,P171:P173,0))","v":9000},{"$f":"MAX(P171:P173)","v":0},null,{"$f":"INDEX(R171:R173,MATCH(MIN(ABS(R171:R173-$D$131)),ABS(R171:R173-$D$131),0))","v":9000},null,{"$f":"INDEX(T171:T173,MATCH(MIN(ABS(T171:T173-$D$131)),ABS(T171:T173-$D$131),0))","v":9000},null,{"$f":"INDEX(V171:V173,MATCH(MIN(ABS(V171:V173-$D$131)),ABS(V171:V173-$D$131),0))","v":9000}]
[null,"AFC-HSS-H40-SI",4,{"$f":"IF((OR(J83=0,J83>6)),9000,J83)","v":7.2882404999999997E-2},{"$f":"INDEX($F$181:$F$249,MATCH(D175,$E$181:$E$249,1))","v":0.94999999999999529},{"$f":"IF(D175=$D$178,9000,D175)","v":9000},{"$f":"INDEX($F$181:$F$249,MATCH(F175,$E$181:$E$249,1))","v":0},{"$f":"IF(F175=$F$178,9000,F175)","v":9000},{"$f":"INDEX($F$181:$F$249,MATCH(H175,$E$181:$E$249,1))","v":0},"PR-23-W40",{"$f":"IF((OR(J110=0,J110>6)),9000,J110)","v":1.0030000000000001E-2},{"$f":"INDEX($F$181:$F$249,MATCH(K175,$E$181:$E$249,1))","v":0.24999999999999534},{"$f":"IF(K175=$K$178,9000,K175)","v":9000},{"$f":"INDEX($F$181:$F$249,MATCH(M175,$E$181:$E$249,1))","v":0},{"$f":"IF(M175=$M$178,9000,M175)","v":9000},{"$f":"INDEX($F$181:$F$249,MATCH(O175,$E$181:$E$249,1))","v":0},null,9000,null,9000,null,9000]
[null,null,null,9000,{"$f":"INDEX($F$181:$F$249,MATCH(D176,$E$181:$E$249,1))","v":0},9000,{"$f":"INDEX($F$181:$F$249,MATCH(F176,$E$181:$E$249,1))","v":0},9000,{"$f":"INDEX($F$181:$F$249,MATCH(H176,$E$181:$E$249,1))","v":0},null,9000,{"$f":"INDEX($F$181:$F$249,MATCH(K176,$E$181:$E$249,1))","v":0},9000,{"$f":"INDEX($F$181:$F$249,MATCH(M176,$E$181:$E$249,1))","v":0},9000,{"$f":"INDEX($F$181:$F$249,MATCH(O176,$E$181:$E$249,1))","v":0},null,9000,null,9000,null,9000]
[null,null,null,9000,{"$f":"INDEX($F$181:$F$249,MATCH(D177,$E$181:$E$249,1))","v":0},9000,{"$f":"INDEX($F$181:$F$249,MATCH(F177,$E$181:$E$249,1))","v":0},9000,{"$f":"INDEX($F$181:$F$249,MATCH(H177,$E$181:$E$249,1))","v":0},null,9000,{"$f":"INDEX($F$181:$F$249,MATCH(K177,$E$181:$E$249,1))","v":0},9000,{"$f":"INDEX($F$181:$F$249,MATCH(M177,$E$181:$E$249,1))","v":0},9000,{"$f":"INDEX($F$181:$F$249,MATCH(O177,$E$181:$E$249,1))","v":0},null,9000,null,9000,null,9000]
[null,null,"tulos",{"$f":"INDEX(D175:D177,MATCH(E178,E175:E177,0))","v":7.2882404999999997E-2},{"$f":"MAX(E175:E177)","v":0.94999999999999529},{"$f":"INDEX(F175:F177,MATCH(G178,G175:G177,0))","v":9000},{"$f":"MAX(G175:G177)","v":0},{"$f":"INDEX(H175:H177,MATCH(I178,I175:I177,0))","v":9000},{"$f":"MAX(I175:I177)","v":0},null,{"$f":"INDEX(K175:K177,MATCH(L178,L175:L177,0))","v":1.0030000000000001E-2},{"$f":"MAX(L175:L177)","v":0.24999999999999534},{"$f":"INDEX(M175:M177,MATCH(N178,N175:N177,0))","v":9000},{"$f":"MAX(N175:N177)","v":0},{"$f":"INDEX(O175:O177,MATCH(P178,P175:P177,0))","v":9000},{"$f":"MAX(P175:P177)","v":0},null,{"$f":"INDEX(R175:R177,MATCH(MIN(ABS(R175:R177-$D$131)),ABS(R175:R177-$D$131),0))","v":9000},null,{"$f":"INDEX(T175:T177,MATCH(MIN(ABS(T175:T177-$D$131)),ABS(T175:T177-$D$131),0))","v":9000},null,{"$f":"INDEX(V175:V177,MATCH(MIN(ABS(V175:V177-$D$131)),ABS(V175:V177-$D$131),0))","v":9000}]
[]
[]
[null,null,null,null,0,{"$f":"F182-0.7","v":0.24999999999999534},null,"flow on prism",null,null,1.5,100]
[null,null,null,null,0.05,0.94999999999999529,null,1.5,null,null,1.6,{"$f":"L181-2","v":98}]
[null,null,null,null,0.1,1.6499999999999952,null,null,"value",null,1.7,{"$f":"L182-2","v":96}]
[null,null,null,null,0.15,2.3499999999999952,null,null,{"$f":"INDEX($L$181:$L$249,MATCH(H182,$K$181:$K$249,-1))","v":100},null,1.8,94]
[null,null,null,null,0.2,3.0499999999999954,null,null,null,null,1.9,92]
[null,null,null,null,0.25,3.7499999999999956,null,null,null,null,2,90]
[null,null,null,null,0.3,4.4499999999999957,null,null,null,null,2.1,88]
[null,null,null,null,0.35,5.1499999999999959,null,null,null,null,2.2000000000000002,86]
[null,null,null,null,0.4,5.8499999999999961,null,null,null,null,2.2999999999999998,84]
[null,null,null,null,0.45,6.5499999999999963,null,null,null,null,2.4,82]
[null,null,null,null,0.5,7.2499999999999964,null,null,null,null,2.5,80]
[null,null,null,null,0.55000000000000004,7.9499999999999966,null,null,null,null,2.6,78]
[null,null,null,null,0.6,8.6499999999999968,null,null,null,null,2.7,76]
[null,null,null,null,0.65,9.3499999999999961,null,null,null,null,2.8,74]
[null,null,null,null,0.7,{"$f":"F196-2.85","v":10.049999999999995},null,null,null,null,2.9,72]
[null,null,null,null,0.8,12.899999999999995,null,null,null,null,3,70]
[null,null,null,null,0.9,15.749999999999995,null,null,null,null,3.1,68]
[null,null,null,null,1,18.599999999999994,null,null,null,null,3.2,66]
[null,null,null,null,1.1000000000000001,21.449999999999996,null,null,null,null,3.3,64]
[null,null,null,null,1.2,24.299999999999997,null,null,null,null,3.4,62]
[null,null,null,null,1.3,27.15,null,{"$f":"INDEX($L$181:$L$249,MATCH(M159,$K$181:$K$249,-1))","v":4.6499999999999959},null,null,3.5,60]
[null,null,null,null,1.4,30,null,null,null,null,3.6,58]
[null,null,null,null,1.5,100,null,null,null,null,3.7,56]
[null,null,null,null,1.6,{"$f":"F203-2","v":98},null,null,null,null,3.8,54]
[null,null,null,null,1.7,{"$f":"F204-2","v":96},null,null,null,null,3.9,52]
[null,null,null,null,1.8,94,null,null,null,null,4,50]
[null,null,null,null,1.9,92,null,null,null,null,4.0999999999999996,48]
[null,null,null,null,2,90,null,null,null,null,4.2,46]
[null,null,null,null,2.1,88,null,null,null,null,4.3,44]
[null,null,null,null,2.2000000000000002,86,null,null,null,null,4.4000000000000004,42]
[null,null,null,null,2.2999999999999998,84,null,null,null,null,4.5,40]
[null,null,null,null,2.4,82,null,null,null,null,4.5999999999999996,38]
[null,null,null,null,2.5,80,null,null,null,null,4.7,36]
[null,null,null,null,2.6,78,null,null,null,null,4.8,34]
[null,null,null,null,2.7,76,null,null,null,null,4.9000000000000004,32]
[null,null,null,null,2.8,74,null,null,null,null,5,30]
[null,null,null,null,2.9,72,null,null,null,null,1.4,29.5]
[null,null,null,null,3,70,null,null,null,null,5.0999999999999996,{"$f":"L216-2","v":28}]
[null,null,null,null,3.1,68,null,null,null,null,1.3,{"$f":"L217-2.85","v":26.65}]
[null,null,null,null,3.2,66,null,null,null,null,5.2,{"$f":"L218-2","v":26}]
[null,null,null,null,3.3,64,null,null,null,null,5.3,{"$f":"L220-2","v":24}]
[null,null,null,null,3.4,62,null,null,null,null,1.2,{"$f":"L219-2.85","v":23.799999999999997}]
[null,null,null,null,3.5,60,null,null,null,null,5.4,{"$f":"L221-2","v":22}]
[null,null,null,null,3.6,58,null,null,null,null,1.1000000000000001,{"$f":"L222-2.85","v":20.949999999999996}]
[null,null,null,null,3.7,56,null,null,null,null,5.5,{"$f":"L223-2","v":20}]
[null,null,null,null,3.8,54,null,null,null,null,5.6,{"$f":"L225-2","v":18}]
[null,null,null,null,3.9,52,null,null,null,null,1,{"$f":"L224-2.85","v":18.099999999999994}]
[null,null,null,null,4,50,null,null,null,null,5.7,{"$f":"L226-2","v":16}]
[null,null,null,null,4.0999999999999996,48,null,null,null,null,0.9,{"$f":"L227-2.85","v":15.249999999999995}]
[null,null,null,null,4.2,46,null,null,null,null,5.8,{"$f":"L228-2","v":14}]
[null,null,null,null,4.3,44,null,null,null,null,5.9,{"$f":"L230-2","v":12}]
[null,null,null,null,4.4000000000000004,42,null,null,null,null,0.8,{"$f":"L229-2.85","v":12.399999999999995}]
[null,null,null,null,4.5,40,null,null,null,null,6,10]
[null,null,null,null,4.5999999999999996,38,null,null,null,null,0.7,{"$f":"L232-2.85","v":9.5499999999999954}]
[null,null,null,null,4.7,36,null,null,null,null,0.65,{"$f":"L234-0.7","v":8.8499999999999961}]
[null,null,null,null,4.8,34,null,null,null,null,0.6,8.1499999999999968]
[null,null,null,null,4.9000000000000004,32,null,null,null,null,0.55000000000000004,7.4499999999999966]
[null,null,null,null,5,30,null,null,null,null,0.5,6.7499999999999964]
[null,null,null,null,5.0999999999999996,28,null,null,null,null,0.45,6.0499999999999963]
[null,null,null,null,5.2,26,null,null,null,null,0.4,5.3499999999999961]
[null,null,null,null,5.3,24,null,null,null,null,0.35,4.6499999999999959]
[null,null,null,null,5.4,22,null,null,null,null,0.3,3.9499999999999957]
[null,null,null,null,5.5,20,null,null,null,null,0.25,3.2499999999999956]
[null,null,null,null,5.6,18,null,null,null,null,0.2,2.5499999999999954]
[null,null,null,null,5.7,16,null,null,null,null,0.15,1.8499999999999954]
[null,null,null,null,5.8,14,null,null,null,null,0.1,1.1499999999999955]
[null,null,null,null,5.9,12,null,null,null,null,0.05,0.44999999999999551]
[null,null,null,null,6,10,null,null,null,null,9000,0]
[null,null,null,null,9000,0,null,null,null,null,0,{"$f":"L247-0.7","v":-0.25000000000000444}]

{"sheet":"Data","index":2,"n_rows":246,"n_cols":65,"rows_kept":246,"cut":false,"hidden":true,"merged":[]}
[null,null,null,null,null,null,null,null,null,null,null,"Results from trendline"]
[null,"Goal (Averaged Value)",null,null,null,null,null,null,null,null,null,null,null,null,null,null,null,null,null,null,null,null,null,null,null,null,null,null,null,null,null,null,null,null,null,null,null,null,null,null,null,null,null,null,null,null,null,null,null,null,null,null,null,null,null,null,null,null,null,null,null,null,null,"1244 0.75 [1244]","2184 0.75 [2184]"]
[null,null,"AFC-HSS-H10-RI","Inletflow (m^3/h)",0.5,2.4,4.3,6.2,8.1,10,null,"Metric","Inch"]
[null,null,null,"Max Flow [m/s]",0.73588790900000001,3.93483597,7.1182416899999996,10.3799802,13.4394578,16.888976100000001,null,null,null,null,null,null,null,null,null,null,null,null,null,null,null,null,null,null,null,null,null,null,null,null,null,null,null,null,null,null,null,null,null,null,null,null,null,null,null,null,null,null,null,null,null,null,null,null,null,null,null,null,null,1.8352579194964801E-4,1.80159459048161E-4]
[null,null,"*'Flow Calc Metric'!G131^2","VG Av Velocity 1 [m/s]",0.390161814,1.55013515,2.6361944199999998,3.7909672599999999,5.0584977799999997,5.8948948899999998,null,{"$f":" 0.6068*Metric!G131","v":1.7900600000000002},{"$f":" 0.6068*Inch!G131","v":1.7916503515435847},null,{"$f":" 0.007*Metric!G131^2 + 0.0011*Metric!G131","v":6.4162500000000011E-2},{"$f":" 0.007*Inch!G131^2 + 0.0011*Inch!G131","v":6.4273673504153722E-2},null,{"$f":" 0.0058*Metric!G131^2 + 1.6262*Metric!G131","v":4.8477645000000003},{"$f":" 0.0058*Inch!G131^2 + 1.6262*Inch!G131","v":4.8521163056775247},null,null,null,null,null,null,null,null,null,null,null,null,null,null,null,null,null,null,null,null,null,null,null,null,null,null,null,null,null,null,"Mittari 1",null,"Chemical Industry Best","Chemical Industry 2nd Best","Chemical Industry 3rd Best","Food Industry Best","Food Industry 2nd Best","Food Industry 3rd Best","Semiconductor Best","Semiconductor 2nd Best","Semiconductor 3rd Best",null,null,0.73373913820548498,"Cannot find goal"]
[null,null,"*'Flow Calc Inch'!G131^2","Pressure loss [Pa]",2.1491643299999998E-3,4.2229684099999998E-2,0.13237379399999999,0.27606497699999999,0.47081005199999998,0.70912201500000005,null,null,null,null,null,null,null,null,null,null,null,null,null,null,null,null,null,null,null,null,null,null,null,null,null,null,null,null,null,null,null,null,null,null,null,null,null,null,"METRIC",null,null,null,null,null,null,null,null,null,null,null,null,null,730.98318950726002,586.177258176073]
[null,null,null,null,null,null,null,null,null,null,null,null,null,null,null,null,null,null,null,null,null,null,null,null,null,null,null,null,null,null,null,null,null,null,null,null,null,null,null,null,null,null,null,null,null,null,null,null,null,0,null,{"$f":"IF(Metric!$C137>6,6,Metric!$C137)","v":1.9814117500000004},{"$f":"IF(Metric!$E137>6,6,Metric!$E137)","v":2.211792},{"$f":"IF(Metric!$G137>6,6,Metric!$G137)","v":1.4718582499999999},{"$f":"IF(Metric!$C138>6,6,Metric!$C138)","v":1.7900600000000002},{"$f":"IF(Metric!$E138>6,6,Metric!$E138)","v":1.4319300000000001},{"$f":"IF(Metric!$G138>6,6,Metric!$G138)","v":0.41477000000000003},{"$f":"IF(Metric!$C139>6,6,Metric!$C139)","v":2.3875087500000003},{"$f":"IF(Metric!$E139>6,6,Metric!$E139)","v":3.0535597500000002},{"$f":"IF(Metric!$G139>6,6,Metric!$G139)","v":6}]
[null,null,"AFC-HSS-H10-SI","Inletflow (m^3/h)",0.8,3.04,5.28,7.52,9.76,12,null,null,null,null,null,null,null,null,null,null,null,null,null,null,null,null,null,null,null,null,null,null,null,null,null,null,null,null,null,null,null,null,null,null,null,null,null,null,null,0.75,null,0.1,0.1,0.1,0.1,0.1,0.1,0.1,0.1,0.1]
[null,null,null,"Max Flow [m/s]",0.87696448500000002,3.33743809,5.8290383200000004,8.3471447300000001,10.819623099999999,13.3101352,null,null,null,null,null,null,null,null,null,null,null,null,null,null,null,null,null,null,null,null,null,null,null,null,null,null,null,null,null,null,null,null,null,null,null,null,null,null,null,0.75,null,{"$f":"12-(AZ7+AZ8)","v":9.9185882499999991},{"$f":"12-(BA7+BA8)","v":9.6882079999999995},10.42814175,10.10994,10.468069999999999,11.48523,9.5124912500000001,8.8464402500000006,5.9]
[null,null,null,"VG Av Velocity 1 [m/s]",0.36638758399999999,1.4746694899999999,2.5752101700000001,3.68249526,4.7270001400000003,5.80978043,null,{"$f":"0.4854*Metric!G131","v":1.4319300000000001},{"$f":" 0.4854*Inch!G131","v":1.433202176399565},null,{"$f":" 0.003*Metric!G131^2 + 0.0003*Metric!G131","v":2.6992500000000003E-2},{"$f":" 0.003*Inch!G131^2 + 0.0003*Inch!G131","v":2.7039696493339566E-2},null,{"$f":"0.0007*Metric!G131^2 + 1.102*Metric!G131","v":3.2569917500000005},{"$f":" 0.0007*Inch!G131^2 + 1.102*Inch!G131","v":3.2598907916456703},null,null,null,null,null,null,null,null,null,null,null,null,null,null,null,null,null,null,null,null,null,null,null,null,null,null,null,null,null,null,3.5]
[null,null,null,"Pressure loss [Pa]",2.0436868699999998E-3,2.8681982799999999E-2,8.5988810900000004E-2,0.174547867,0.29076269100000002,0.440235341,null,null,null,null,null,null,null,null,null,null,null,null,null,null,null,null,null,null,null,null,null,null,null,null,null,null,null,null,null,null,null,null,null,null,null,null,null,null,null,1]
[null,null,null,null,null,null,null,null,null,null,null,null,null,null,null,null,null,null,null,null,null,null,null,null,null,null,null,null,null,null,null,null,null,null,null,null,null,null,null,null,null,null,null,null,null,null,null,null,null,6]
[null,null,"AFC-HSS-H15-RI","Inletflow (m^3/h)",1,3.8,6.6,9.4,12.2,15]
[null,null,null,"Max Flow [m/s]",0.75916479400000003,2.9702317699999998,5.2327335000000001,7.4828602599999998,9.7693708899999994,12.0375719,null,null,null,null,null,null,null,null,null,null,null,null,null,null,null,null,null,null,null,null,null,null,null,null,null,null,null,null,null,null,null,null,null,null,null,null,null,null,"INCH","Mittari 2",null,"Chemical Industry Best","Chemical Industry 2nd Best","Chemical Industry 3rd Best","Food Industry Best","Food Industry 2nd Best","Food Industry 3rd Best","Semiconductor Best","Semiconductor 2nd Best","Semiconductor 3rd Best"]
[null,null,null,"VG Av Velocity 1 [m/s]",0.34272124199999998,1.44317625,2.7280423100000002,3.9251458399999999,5.0635379199999999,6.22142705,null,{"$f":" 0.0009*Metric!G131^2 + 0.4025*Metric!G131","v":1.1952072500000002},{"$f":" 0.0009*Inch!G131^2 + 0.4025*Inch!G131","v":1.1962760783030677},null,{"$f":" 0.0018*Metric!G131^2 + 0.0002*Metric!G131","v":1.6254500000000002E-2},{"$f":" 0.0018*Inch!G131^2 + 0.0002*Inch!G131","v":1.6282870313655141E-2},null,{"$f":" 0.0014*Metric!G131^2 + 0.7823*Metric!G131","v":2.3199684999999999},{"$f":" 0.0014*Inch!G131^2 + 0.7823*Inch!G131","v":2.3220404745413163}]
[null,null,null,"Pressure loss [Pa]",1.89761144E-3,2.6190105000000002E-2,7.8841006300000002E-2,0.16020652199999999,0.26821016800000003,0.40488223200000001,null,null,null,null,null,null,null,null,null,null,null,null,null,null,null,null,null,null,null,null,null,null,null,null,null,null,null,null,null,null,null,null,null,null,null,null,null,null,null,0,null,{"$f":"IF(Inch!C137>20,20,Inch!C137)","v":9.2501275581206563},{"$f":"IF(Inch!E137>20,20,Inch!E137)","v":2.2137632236939035},{"$f":"IF(Inch!G137>20,20,Inch!G137)","v":1.98313109118668},{"$f":"IF(Inch!C138>20,20,Inch!C138)","v":1.7916503515435847},{"$f":"IF(Inch!E138>20,20,Inch!E138)","v":1.433202176399565},{"$f":"IF(Inch!G138>20,20,Inch!G138)","v":1.1962760783030677},{"$f":"IF(Inch!C139>20,20,Inch!C139)","v":3.0563028186959746},{"$f":"IF(Inch!E139>20,20,Inch!E139)","v":2.3897034112758813},{"$f":"IF(Inch!G139>20,20,Inch!G139)","v":20}]
[null,null,null,null,null,null,null,null,null,null,null,null,null,null,null,null,null,null,null,null,null,null,null,null,null,null,null,null,null,null,null,null,null,null,null,null,null,null,null,null,null,null,null,null,null,null,null,null,null,2.5,null,0.3,0.3,0.3,0.3,0.3,0.3,0.3,0.3,0.3]
[null,null,"AFC-HSS-H15-SI","Inletflow (m^3/h)",2,6,10,14,18,22,null,null,null,null,null,null,null,null,null,null,null,null,null,null,null,null,null,null,null,null,null,null,null,null,null,null,null,null,null,null,null,null,null,null,null,null,null,null,null,2.5,null,{"$f":"40-(AZ16+AZ17)","v":30.449872441879343},37.4862367763061,37.716868908813318,37.908349648456415,38.266797823600434,38.503723921696931,36.643697181304027,37.310296588724121,19.7]
[null,null,null,"Max Flow [m/s]",0.83353321999999996,2.6196960900000001,5.0146590299999998,6.95862552,8.7219761400000007,11.067806600000001,null,null,null,null,null,null,null,null,null,null,null,null,null,null,null,null,null,null,null,null,null,null,null,null,null,null,null,null,null,null,null,null,null,null,null,null,null,null,null,11.5]
[null,null,null,"VG Av Velocity 1 [m/s]",0.37923552700000002,1.5103476499999999,2.8571144400000001,3.9878673199999999,5.0777035100000001,6.3368571100000004,null,{"$f":" 0.0011*Metric!G131^2 + 0.2645*Metric!G131","v":0.78984775000000007},{"$f":" 0.0011*Inch!G131^2 + 0.2645*Inch!G131","v":0.79055799052362086},null,{"$f":" 0.0005*Metric!G131^2 - 0.0002*Metric!G131","v":3.7612499999999998E-3},{"$f":" 0.0005*Inch!G131^2 - 0.0002*Inch!G131","v":3.7684608615807164E-3},null,{"$f":" 0.0017*Metric!G131^2 + 0.4646*Metric!G131","v":1.3853642500000001},{"$f":" 0.0017*Inch!G131^2 + 0.4646*Inch!G131","v":1.3866082111716274},null,null,null,null,null,null,null,null,null,null,null,null,null,null,null,null,null,null,null,null,null,null,null,null,null,null,null,null,null,null,3.5]
[null,null,null,"Pressure loss [Pa]",1.5902671299999999E-3,1.7018251000000002E-2,5.3723543800000002E-2,0.104554833,0.1709994,0.25997683399999999,null,null,null,null,null,null,null,null,null,null,null,null,null,null,null,null,null,null,null,null,null,null,null,null,null,null,null,null,null,null,null,null,null,null,null,null,null,null,null,20]
[]
[null,null,"AFC-HSS-H20-RI","Inletflow (m^3/h)",2,7.6,13.2,18.8,24.4,30]
[null,null,null,"Max Flow [m/s]",0.77709319799999999,3.0152028099999999,5.2484483600000003,7.4572171899999997,9.6824846900000008,12.0123484]
[null,null,null,"VG Av Velocity 1 [m/s]",0.38263522900000002,1.4978800699999999,2.61012559,3.72318053,4.8487568899999998,5.9469829299999999,null,{"$f":" 0.00004*Metric!G131^2 + 0.1973*Metric!G131","v":0.58238310000000004},{"$f":" 0.00004*Inch!G131^2 + 0.1973*Inch!G131","v":0.58290081893414392},null,{"$f":" 0.0004*Metric!G131^2 + 0.00006*Metric!G131","v":3.6580000000000007E-3},{"$f":" 0.0004*Inch!G131^2 + 0.00006*Inch!G131","v":3.6643452834300124E-3},null,{"$f":" 0.0002*Metric!G131^2 + 0.393*Metric!G131","v":1.1610905},{"$f":" 0.0002*Inch!G131^2 + 0.393*Inch!G131","v":1.1621236008653184}]
[null,null,null,"Pressure loss [Pa]",1.5688109E-3,2.2402216799999999E-2,6.6970009999999996E-2,0.13557641100000001,0.228054804,0.34390560199999998]
[]
[null,null,"AFC-HSS-H20-SI","Inletflow (m^3/h)",4,15.2,26.4,37.6,48.8,60]
[null,null,null,"Max Flow [m/s]",1.4674012700000001,5.6991953400000002,9.9244627399999992,14.134708399999999,18.374742300000001,22.5797861]
[null,null,null,"VG Av Velocity 1 [m/s]",0.40362452900000001,1.5458666299999999,2.6654787400000002,3.77078932,4.8654569399999996,5.9579937200000002,null,{"$f":" 0.0998*Metric!G131","v":0.29441000000000001},{"$f":" 0.0998*Inch!G131","v":0.29467156408050388},null,{"$f":" 0.0001*Metric!G131^2 + 0.0001*Metric!G131","v":1.1652500000000001E-3},{"$f":" 0.0001*Inch!G131^2 + 0.0001*Inch!G131","v":1.1670590958759684E-3},null,{"$f":" 0.00002*Metric!G131^2 + 0.3751*Metric!G131","v":1.1067190500000001},{"$f":" 0.00002*Inch!G131^2 + 0.3751*Inch!G131","v":1.1077024524535979}]
[null,null,null,"Pressure loss [Pa]",1.9587415799999998E-3,2.7496379500000001E-2,8.2223087E-2,0.165685212,0.276612621,0.41613443]
[]
[null,null,"AFC-HSS-H25-SI","Inletflow (m^3/h)",6,24.8,43.6,62.4,81.2,100]
[null,null,null,"Max Flow [m/s]",1.1720310700000001,5.0605850099999996,8.9541058899999992,12.862336000000001,16.7762362,20.686721299999999]
[null,null,null,"VG Av Velocity 1 [m/s]",0.36736906000000003,1.5900081399999999,2.7191576,3.86586031,5.0076368000000002,6.1262001000000001,null,{"$f":" 0.0617*Metric!G131","v":0.18201500000000001},{"$f":" 0.0617*Inch!G131","v":0.18217670845458006},null,{"$f":" 0.00003*Metric!G131^2 + 0.00003*Metric!G131","v":3.4957500000000008E-4},{"$f":" 0.00003*Inch!G131^2 + 0.00003*Inch!G131","v":3.5011772876279051E-4},null,{"$f":" 0.00003*Metric!G131^2 + 0.204*Metric!G131","v":0.60206107500000006},{"$f":" 0.00003*Inch!G131^2 + 0.204*Inch!G131","v":0.60259619914660212}]
[null,null,null,"Pressure loss [Pa]",1.3232842200000001E-3,2.18429822E-2,6.6630643599999997E-2,0.13580452600000001,0.22923170900000001,0.34638937800000003]
[]
[null,null,"AFC-HSS-H30-SI","Inletflow (m^3/h)",8,30.4,52.8,75.2,97.6,120]
[null,null,null,"Max Flow [m/s]",0.66299965199999999,2.5035481000000002,4.3310562700000004,6.1476386600000001,7.9558574000000002,9.7567135100000009]
[null,null,null,"VG Av Velocity 1 [m/s]",0.38815639499999999,1.52117188,2.6517065099999999,3.78272355,4.9204301600000004,6.0565686000000003,null,{"$f":" 0.000004*Metric!G131^2 + 0.05*Metric!G131","v":0.14753481000000002},{"$f":" 0.000004*Inch!G131^2 + 0.05*Inch!G131","v":0.14766591600881374},null,{"$f":" 0.000003*Metric!G131^2 + 0.00002*Metric!G131","v":8.5107500000000018E-5},{"$f":" 0.000003*Inch!G131^2 + 0.00002*Inch!G131","v":8.5206327879972098E-5},null,{"$f":"0.0815*Metric!G131","v":0.24042500000000003},{"$f":" 0.0815*Inch!G131","v":0.24063860192946962}]
[null,null,null,"Pressure loss [Pa]",2.4768474299999998E-4,3.2079211099999999E-3,9.2790749399999997E-3,1.83349615E-2,3.0318770799999999E-2,4.5151915000000001E-2]
[]
[null,null,"AFC-HSS-H40-SI","Inletflow (m^3/h)",18,64.400000000000006,110.8,157.19999999999999,203.6,250,null,null,null,null,null,null,null,null,null,null,null,null,null,null,null,null,null,null,null,null,null,null,null,null,null,null,null,null,null,null,null,null,null,null,null,null,null,null,null,null,null,null,null,2.82743338823081E-5,2.82743338823081E-5,null,null,null,null,null,null,null,2.82743338823081E-5,2.82743338823081E-5]
[null,null,null,"Max Flow [m/s]",0.82323128000000001,2.9235729899999998,5.0042738699999996,7.0709604300000004,9.1263175299999997,11.172575699999999]
[null,null,null,"VG Av Velocity 1 [m/s]",0.440554844,1.5984452199999999,2.76156757,3.9389822699999999,5.1204363199999996,6.3095078200000003,null,{"$f":" 0.000002*Metric!G131^2 + 0.0247*Metric!G131","v":7.2882404999999997E-2},{"$f":" 0.000002*Inch!G131^2 + 0.0247*Inch!G131","v":7.2947171739635802E-2},null,{"$f":" 0.0000008*Metric!G131^2 + 0.00001*Metric!G131","v":3.6462000000000004E-5},{"$f":" 0.0000008*Inch!G131^2 + 0.00001*Inch!G131","v":3.6500584886653398E-5},null,{"$f":" 0.0448*Metric!G131","v":0.13216},{"$f":" 0.0448*Inch!G131","v":0.13227741553914402}]
[null,null,null,"Pressure loss [Pa]",3.3187116999999999E-4,3.7962188700000001E-3,1.07545773E-2,2.10651538E-2,3.4623037000000002E-2,5.1361028199999999E-2]
[]
[null,null,"SFC-HHSS-H10-090","Inletflow (m^3/h)",3,11.4,19.8,28.2,36.6,45]
[null,null,null,"Max Flow [m/s]",2.6661858899999999,10.460183300000001,18.4264449,26.294295699999999,34.380455599999998,42.396292600000002]
[null,null,"*'Metric'!G131^2","VG Av Velocity 1 [m/s]",0.44236104999999998,1.65011302,2.8786030999999999,4.0239299800000001,5.1185888100000003,6.2557787200000003,null,{"$f":" 0.1406*Metric!G131","v":0.41477000000000003},{"$f":" 0.1406*Inch!G131","v":0.4151384960893672},null,{"$f":" 0.0031*Metric!G131^2 + 0.0012*Metric!G131","v":3.0517750000000003E-2},{"$f":" 0.0031*Inch!G131^2 + 0.0012*Inch!G131","v":3.0568852295271676E-2},null,{"$f":" 0.0006*Metric!G131^2 + 0.9163*Metric!G131","v":2.7083065000000004},{"$f":" 0.0006*Inch!G131^2 + 0.9163*Inch!G131","v":2.7107172967447686}]
[null,null,"*'Inch'!G131^2","Pressure loss [Pa]",2.95558127E-2,0.414982923,1.2422527000000001,2.5092839200000001,4.21160918,6.3491477300000003]
[]
[null,null,"SFC-HHSS-H10-180","Inletflow (m^3/h)",6,18.8,31.6,44.4,57.2,70]
[null,null,null,"Max Flow [m/s]",5.4583053599999998,17.097190900000001,28.7438599,40.373378700000004,52.000134699999997,63.685616500000002]
[null,null,null,"VG Av Velocity 1 [m/s]",0.52815215599999998,1.6943546899999999,2.8915212299999999,4.02024005,5.1192350700000002,6.2683192400000003,null,{"$f":" 0.0899*Metric!G131","v":0.26520500000000002},{"$f":" 0.0899*Inch!G131","v":0.26544061734305907},null,{"$f":" 0.0021*Metric!G131^2 + 0.0008*Metric!G131","v":2.0635250000000001E-2},{"$f":" 0.0021*Inch!G131^2 + 0.0008*Inch!G131","v":2.0669833866054102E-2},null,{"$f":" 0.000009*Metric!G131^2 + 0.909*Metric!G131","v":2.6816283224999999},{"$f":" 0.000009*Inch!G131^2 + 0.909*Inch!G131","v":2.6840108439869783}]
[null,null,null,"Pressure loss [Pa]",7.8691549700000002E-2,0.75101438200000004,2.0940502300000001,4.1079155900000002,6.8343846599999996,10.2046806]
[]
[null,null,"SFC-HHSS-H15-090","Inletflow (m^3/h)",5,18,31,44,57,70]
[null,null,null,"Max Flow [m/s]",1.8267138999999999,6.5476889199999997,11.264396400000001,15.9881531,21.0214167,25.814540900000001]
[null,null,null,"VG Av Velocity 1 [m/s]",0.416489147,1.6732389400000001,2.7943291800000001,4.0227472400000002,5.1526324099999998,6.3399622400000002,null,{"$f":" 0.0907*Metric!G131","v":0.267565},{"$f":" 0.0907*Inch!G131","v":0.26780271404911526},null,{"$f":" 0.0008*Metric!G131^2 - 0.0062*Metric!G131","v":-1.1328E-2},{"$f":" 0.0008*Inch!G131^2 - 0.0062*Inch!G131","v":-1.1331873410983507E-2},null,{"$f":" 0.0001*Metric!G131^2 + 0.3591*Metric!G131","v":1.0602152499999999},{"$f":" 0.0001*Inch!G131^2 + 0.3591*Inch!G131","v":1.0611579559385702}]
[null,null,null,"Pressure loss [Pa]",1.3910498800000001E-2,0.18082267499999999,0.54827219199999999,1.10627067,2.18264521,3.2894304399999998]
[]
[null,null,"SFC-HHSS-H15-180","Inletflow (m^3/h)",8,32,56,80,104,128]
[null,null,null,"Max Flow [m/s]",2.8942688099999998,11.6236704,20.3020116,28.9528508,37.555756000000002,46.1586949]
[null,null,null,"VG Av Velocity 1 [m/s]",0.39057365700000002,1.62748523,2.8525152199999999,4.0548244200000001,5.0320471800000002,6.1729924199999999,null,{"$f":" 0.049*Metric!G131","v":0.14455000000000001},{"$f":" 0.049*Inch!G131","v":0.1446784232459388},null,{"$f":" 0.0003*Metric!G131^2 - 0.00003*Metric!G131","v":2.5222499999999998E-3},{"$f":" 0.0003*Inch!G131^2 - 0.00003*Inch!G131","v":2.5268123963797457E-3},null,{"$f":" 0.3612*Metric!G131","v":1.0655400000000002},{"$f":" 0.3612*Inch!G131","v":1.0664866627843488}]
[null,null,null,"Pressure loss [Pa]",1.8028182600000001E-2,0.28190670400000001,0.86473359000000005,1.7691855400000001,2.9706443999999999,4.52202635]
[]
[null,null,"SFC-HHSS-H20-090","Inletflow (m^3/h)",5,10,27,44,61,78]
[null,null,null,"Max Flow [m/s]",1.3167530000000001,2.6139759800000002,7.2374749300000003,12.0350708,16.717459399999999,21.221816400000002]
[null,null,null,"VG Av Velocity 1 [m/s]",0.241747236,0.68489714700000004,2.1393590599999999,3.4827990899999999,5.0022683700000004,6.3492699699999999,null,{"$f":" 0.00008*Metric!G131^2 + 0.076*Metric!G131","v":0.22489620000000002},{"$f":" 0.00008*Inch!G131^2 + 0.076*Inch!G131","v":0.22509662468142877},null,{"$f":" 0.0002*Metric!G131^2 - 0.00004*Metric!G131","v":1.6225000000000002E-3},{"$f":" 0.0002*Inch!G131^2 - 0.00004*Inch!G131","v":1.6254891799350937E-3},null,{"$f":" 0.00003*Metric!G131^2 + 0.2706*Metric!G131","v":0.79853107500000009},{"$f":" 0.00003*Inch!G131^2 + 0.2706*Inch!G131","v":0.79924074992577621}]
[null,null,null,"Pressure loss [Pa]",4.4151862299999997E-3,1.8457261199999998E-2,0.136426142,0.36660421199999998,0.70481254999999998,1.1521049800000001]
[]
[null,null,"SFC-HHSS-H20-180","Inletflow (m/s)",15,52,89,126,163,200]
[null,null,null,"Max Flow [m/s]",3.0323715500000001,10.4675414,17.859609500000001,25.229873399999999,32.629945599999999,39.9232066]
[null,null,null,"VG Av Velocity 1 [m/s]",0.43555831299999997,1.5892976599999999,2.6363476800000001,3.7547246200000002,4.9029607200000003,5.8944028399999997,null,{"$f":" 0.0297*Metric!G131","v":8.7615000000000012E-2},{"$f":" 0.0297*Inch!G131","v":8.7692840212334325E-2},null,{"$f":" 0.00006*Metric!G131^2 - 0.0002*Metric!G131","v":-6.7849999999999942E-5},{"$f":" 0.00006*Inch!G131^2 - 0.0002*Inch!G131","v":-6.7445971942665635E-5},null,{"$f":" 0.2*Metric!G131","v":0.59000000000000008},{"$f":" 0.2*Inch!G131","v":0.59052417651403588}]
[null,null,null,"Pressure loss [Pa]",1.3760314500000001E-2,0.163949079,0.48200704500000002,0.96650020699999994,1.63556773,2.4763453100000001]
[]
[null,null,"SFC-HHSS-H25-090","Inletflow (m/s)",14,47.2,80.400000000000006,113.6,146.80000000000001,180]
[null,null,null,"Max Flow [m/s]",2.33050041,7.9134148599999996,13.4979794,19.1030549,24.7081099,30.2919035]
[null,null,null,"VG Av Velocity 1 [m/s]",0.45169934,1.5529963,2.6183325700000002,3.7802056500000001,4.8857106999999997,6.1013062299999996,null,{"$f":" 0.00001*Metric!G131^2 + 0.0319*Metric!G131","v":9.4192024999999999E-2},{"$f":" 0.00001*Inch!G131^2 + 0.0319*Inch!G131","v":9.4275785854750604E-2},null,{"$f":" 0.00006*Metric!G131^2 - 0.00002*Metric!G131","v":4.6315000000000006E-4},{"$f":" 0.00006*Inch!G131^2 - 0.00002*Inch!G131","v":4.6402578691996665E-4},null,{"$f":" 0.000004*Metric!G131^2 + 0.1676*Metric!G131","v":0.49445481000000002},{"$f":" 0.000004*Inch!G131^2 + 0.1676*Inch!G131","v":0.49489413179906677}]
[null,null,null,"Pressure loss [Pa]",1.2364034499999999E-2,0.13834543199999999,0.39929398799999999,0.79660417299999997,1.3271614899999999,2.0045730000000002]
[]
[null,null,"SFC-HHSS-H25-180","Inletflow (m/s)",7,27.6,48.2,68.8,89.4,110]
[null,null,null,"Max Flow [m/s]",0.88102382899999998,3.4689570399999998,6.0448725899999998,8.6102442200000002,11.165108399999999,13.713321799999999]
[null,null,"*'Metric'!G131^2","VG Av Velocity 1 [m/s]",0.38278189899999998,1.5261792300000001,2.6711849299999999,3.8249420700000001,4.9841451399999999,6.1559343000000002,null,{"$f":" 0.000009*Metric!G131^2 + 0.055*Metric!G131","v":0.16232832250000001},{"$f":" 0.000009*Inch!G131^2 + 0.055*Inch!G131","v":0.16247261027204557},null,{"$f":" 0.00002*Metric!G131^2 - 0.000006*Metric!G131","v":1.5635000000000003E-4},{"$f":" 0.00002*Inch!G131^2 - 0.000006*Inch!G131","v":1.5664367622836902E-4},null,{"$f":" 0.1249*Metric!G131","v":0.36845500000000003},{"$f":" 0.1249*Inch!G131","v":0.36878234823301537}]
[null,null,"*'Inch'!G131^2","Pressure loss [Pa]",7.7698402899999998E-4,1.1708773699999999E-2,3.5524745199999999E-2,7.2426081500000003E-2,0.122368911,0.18577806499999999]
[]
[null,null,"PMFC-HSS-H04","Inletflow (m/s)",0.02,5.6000000000000001E-2,9.1999999999999998E-2,0.128,0.16400000000000001,0.2]
[null,null,null,"Max Flow",0.85858672999999996,2.4027187300000001,3.9467469300000002,5.4907517700000001,7.0347523499999998,8.5787277399999997]
[null,null,null,"VG Av Velocity 1 [m/s]",0.33471711300000001,1.4400082299999999,2.6001428899999999,3.7514244899999998,4.8599407499999998,5.9649093200000003,null,{"$f":" 20.606*Metric!G131^2 + 26.007*Metric!G131","v":256.04436500000003},{"$f":"20.606*Inch!G131^2 + 26.007*Inch!G131","v":256.43130268296358},null,{"$f":" 8.3811*Metric!G131^2 + 0.8597*Metric!G131","v":75.472637750000004},{"$f":" 8.3811*Inch!G131^2 + 0.8597*Inch!G131","v":75.604547178297423},null,{"$f":" 42.896*Metric!G131","v":126.54320000000001},{"$f":" 42.896*Inch!G131","v":126.65562537873041}]
[null,null,null,"Pressure loss [bar]",2.0047269499999999E-2,7.2571234900000003E-2,0.14869426099999999,0.24927263999999999,0.36847985999999999,0.50542390999999998]
[]
[null,null,"PMFC-HSS-H05","Inletflow (m/s)",0.03,0.108,0.186,0.26400000000000001,0.34200000000000003,0.42]
[null,null,null,"Max Flow [m/s]",0.69503709999999996,2.3110330299999999,3.97854916,5.6517207899999997,7.35152114,9.0307978999999996]
[null,null,null,"VG Av Velocity 1 [m/s]",0.47480902400000002,1.4012153300000001,2.4142318299999999,3.40519419,4.38654498,5.3661551899999997,null,{"$f":" 12.791*Metric!G131","v":37.733450000000005},{"$f":" 12.791*Inch!G131","v":37.766973708955163},null,{"$f":" 2.5547*Metric!G131^2 + 0.0022*Metric!G131","v":22.23876675},{"$f":" 2.5547*Inch!G131^2 + 0.0022*Inch!G131","v":22.278293919582978},null,{"$f":" 0.5324*Metric!G131^2 + 22.764*Metric!G131","v":71.787011000000007},{"$f":" 0.5324*Inch!G131^2 + 22.764*Inch!G131","v":71.854909039390847}]
[null,null,null,"Pressure loss [Pa]",2.38374056E-3,3.0041506400000001E-2,8.8804739699999996E-2,0.178172688,0.29964742700000002,0.45081716500000002]
[]
[null,null,"PMFC-HSS-H06","Inletflow (m/s)",0.04,0.2,0.3,0.4,0.5,0.6]
[null,null,null,"Max Flow [m/s]",0.75636304099999996,3.33257023,5.0051580099999997,6.5819536799999998,8.4302789800000006,10.092108700000001]
[null,null,null,"VG Av Velocity 1 [m/s]",0.39407227500000003,1.97036492,2.9555438299999999,3.9407227499999999,4.9259123000000002,5.9111018599999996,null,{"$f":" 0.00007*Metric!G131^2 + 9.8518*Metric!G131","v":29.063419175000003},{"$f":" 0.00007*Inch!G131^2 + 9.8518*Inch!G131","v":29.089240668810227},null,{"$f":" 0.8727*Metric!G131^2 - 0.0001*Metric!G131","v":7.5943767500000003},{"$f":" 0.8727*Inch!G131^2 - 0.0001*Inch!G131","v":7.6078772234023226},null,{"$f":" 0.6258*Metric!G131^2 + 16.444*Metric!G131","v":53.955824499999999},{"$f":" 0.6258*Inch!G131^2 + 16.444*Inch!G131","v":54.008603466663416}]
[null,null,null,"Pressure loss [Pa]",1.4268994500000001E-3,3.4807134599999998E-2,7.8056879400000001E-2,0.13976485399999999,0.21879047800000001,0.31370567799999999]
[]
[null,null,"PR-33-S (1/4\")","Inletflow (m^3/h)",0.1,0.22,0.34,0.46,0.57999999999999996,0.7]
[null,null,null,"Max Flow [m/s]",3.3637765900000001,7.2830536500000003,11.242186500000001,15.2439406,19.2312409,23.231463399999999]
[null,null,null,"VG Av Velocity 1 [m/s]",0.798715803,1.76253036,2.8666182099999999,4.0356771699999996,5.1319020000000002,6.2575816499999997,null,{"$f":" 1.4579*Metric!G131^2 + 7.966*Metric!G131","v":36.187074750000001},{"$f":" 1.4579*Inch!G131^2 + 7.966*Inch!G131","v":36.230506524630727},null,{"$f":" 6.4897*Metric!G131^2 + 0.12*Metric!G131","v":56.830614250000004},{"$f":" 6.4897*Inch!G131^2 + 0.12*Inch!G131","v":56.931324909355446},null,{"$f":" 0.1377*Metric!G131^2 + 33.082*Metric!G131","v":98.790234250000012},{"$f":" 0.1377*Inch!G131^2 + 33.082*Inch!G131","v":98.879068516677961}]
[null,null,null,"Pressure loss [Pa]",7.3163026199999995E-2,0.33756253899999999,0.79179606599999997,1.4314123400000001,2.2542649199999998,3.26178159]
[]
[null,null,"PR-33-S (1/2\")","Inletflow (m^3/h)",0.2,0.76,1.32,1.88,2.44,3]
[null,null,null,"Max Flow [m/s]",2.0010540099999998,7.6971651300000001,13.444166900000001,19.1766121,24.884728500000001,30.648801299999999]
[null,null,null,"VG Av Velocity 1 [m/s]",0.35815061199999998,1.60312565,2.7967564299999998,3.9735166400000002,5.1728442699999997,6.3549557400000003,null,{"$f":" 0.0059*Metric!G131^2 + 2.1028*Metric!G131","v":6.2546047499999995},{"$f":" 0.0059*Inch!G131^2 + 2.1028*Inch!G131","v":6.2602072153180899},null,{"$f":" 0.4117*Metric!G131^2 + 0.005*Metric!G131","v":3.5975692500000003},{"$f":" 0.4117*Inch!G131^2 + 0.005*Inch!G131","v":3.6039513847800699},null,{"$f":" 0.0249*Metric!G131^2 + 10.142*Metric!G131","v":30.135592250000002},{"$f":" 0.0249*Inch!G131^2 + 10.142*Inch!G131","v":30.162558445923874}]
[null,null,null,"Pressure loss [Pa]",1.6742606300000001E-2,0.24041097,0.72420030899999999,1.46591369,2.4615876600000002,3.7201235499999998]
[]
[null,null,"PR-33-S (3/4\")","Inletflow (m^3/h)",0.8,2.04,3.28,4.5199999999999996,5.76,7]
[null,null,null,"Max Flow [m/s]",4.1227945500000001,10.8687451,17.636003200000001,24.462639899999999,31.173595899999999,37.915280299999999]
[null,null,null,"VG Av Velocity 1 [m/s]",0.56079937999999996,1.6096165499999999,2.64016495,3.7788286499999999,4.8585748600000001,5.8930934400000003,null,{"$f":" 0.0095*Metric!G131^2 + 0.7813*Metric!G131","v":2.3875087500000003},{"$f":" 0.0095*Inch!G131^2 + 0.7813*Inch!G131","v":2.3897034112758813},null,{"$f":" 0.0911*Metric!G131^2 + 0.003*Metric!G131","v":0.8016477500000001},{"$f":" 0.0911*Inch!G131^2 + 0.003*Inch!G131","v":0.80306493658857425},null,{"$f":" 0.0133*Metric!G131^2 + 5.3306*Metric!G131","v":15.84101325},{"$f":" 0.0133*Inch!G131^2 + 5.3306*Inch!G131","v":15.855189878641916}]
[null,null,null,"Pressure loss [Pa]",5.9309108800000003E-2,0.38482760100000002,0.99038853999999998,1.87485653,3.0395489000000002,4.4840461100000004]
[]
[null,null,"PR-33-S (1\")","Inletflow (m^3/h)",0.4,1.52,2.64,3.76,4.88,6]
[null,null,null,"Max Flow [m/s]",2.2215910600000002,8.6278443899999999,15.192625100000001,21.742954999999998,28.284966600000001,34.815796800000001]
[null,null,"*'Metric'!G131^2","VG Av Velocity 1 [m/s]",0.38533100100000001,1.5064134499999999,2.7640011599999998,3.9082411100000001,5.1068341300000002,6.2638698100000001,null,{"$f":" 0.0039*Metric!G131^2 + 1.0236*Metric!G131","v":3.0535597500000002},{"$f":" 0.0039*Inch!G131^2 + 1.0236*Inch!G131","v":3.0563028186959746},null,{"$f":" 0.1228*Metric!G131^2 - 0.0006*Metric!G131","v":1.066897},{"$f":" 0.1228*Inch!G131^2 - 0.0006*Inch!G131","v":1.0687951528265289},null,{"$f":" 0.0175*Metric!G131^2 + 5.7038*Metric!G131","v":16.978503750000002},{"$f":" 0.0175*Inch!G131^2 + 5.7038*Inch!G131","v":16.993723466337105}]
[null,null,"*'Inch'!G131^2","Pressure loss [Pa]",1.99679169E-2,0.28317111700000003,0.85230084900000003,1.7360339600000001,2.92351004,4.4179221799999997]
[]
[null,null,"PR-33-S (3/8\")","Inletflow (m/s)",0.1,0.28000000000000003,0.46,0.64,0.82,1]
[null,null,null,"Max Flow [m/s]",1.5235613299999999,4.1879240199999996,6.9092061100000004,9.6226913300000003,12.3334785,15.0311732]
[null,null,null,"VG Av Velocity 1 [m/s]",0.65517946299999996,1.7568518500000001,2.8604580099999999,3.9781316499999999,5.0957332800000001,6.2190908499999997,null,{"$f":" 6.2203*Metric!G131","v":18.349885},{"$f":" 6.2203*Inch!G131","v":18.366187675851286},null,{"$f":" 1.1545*Metric!G131^2 + 0.0008*Metric!G131","v":10.049396250000001},{"$f":" 1.1545*Inch!G131^2 + 0.0008*Inch!G131","v":10.067258549666839},null,{"$f":" 0.022*Metric!G131^2 + 15.014*Metric!G131","v":44.482754999999997},{"$f":" 0.022*Inch!G131^2 + 15.014*Inch!G131","v":44.522445272584839}]
[null,null,null,"Pressure loss [Pa]",1.29584162E-2,9.1066123400000004E-2,0.243322231,0.47412583000000003,0.77688327099999999,1.15535444]
[]
[null,null,"WFC-05 ","Inletflow (m^3/h)",0.4,0.75,1.5,3,4.5,6]
[null,null,null,"Max Flow [m/s]",1.0899283799999999,2.0348214200000001,4.1551072099999997,8.3911852800000002,12.616558400000001,16.866079599999999]
[null,null,null,"VG Av Velocity 1 [m/s]",0.40570251800000001,0.791296738,1.7275894000000001,3.3726024099999998,5.09225554,6.7546587899999997,null,{"$f":" 0.0002*Metric!G131^2 + 1.1264*Metric!G131","v":3.3246205000000004},{"$f":" 0.0002*Inch!G131^2 + 1.1264*Inch!G131","v":3.3275757561422878},null,{"$f":" 0.024*Metric!G131^2 + 0.0028*Metric!G131","v":0.21712000000000001},{"$f":" 0.024*Inch!G131^2 + 0.0028*Inch!G131","v":0.21749862029974459},null,{"$f":" 0.0078*Metric!G131^2 + 2.7658*Metric!G131","v":8.2269895000000002},{"$f":" 0.0078*Inch!G131^2 + 2.7658*Inch!G131","v":8.2343590036068797}]
[null,null,null,"Pressure loss [Bar]",4.2319857000000004E-3,1.41899505E-2,5.7548914499999999E-2,0.22429744400000001,0.50088210499999997,0.88000060300000005]
[]
[null,null,"WFC-10 ","Inletflow (m^3/h)",0.8,2.64,4.4800000000000004,6.32,8.16,12]
[null,null,null,"Max Flow [m/s]",1.15300322,3.9130808300000002,6.6722026400000001,9.3970940600000006,12.148973099999999,17.914148000000001]
[null,null,null,"VG Av Velocity 1 [m/s]",0.402017925,1.3276149699999999,2.2335924700000001,3.1758005100000002,4.1288506700000003,6.1236414899999998,null,{"$f":" 0.0013*Metric!G131^2 + 0.4951*Metric!G131","v":1.4718582499999999},{"$f":" 0.0013*Inch!G131^2 + 0.4951*Inch!G131","v":1.473175960059542},null,{"$f":" 0.0084*Metric!G131^2 + 0.0007*Metric!G131","v":7.5165999999999997E-2},{"$f":" 0.0084*Inch!G131^2 + 0.0007*Inch!G131","v":7.5297783257790948E-2},null,{"$f":" 0.001*Metric!G131^2 + 1.4812*Metric!G131","v":4.3782425000000007},{"$f":" 0.001*Inch!G131^2 + 1.4812*Inch!G131","v":4.3821400213391399}]
[null,null,null,"Pressure loss [Pa]",5.5030320800000003E-3,5.9685785800000002E-2,0.17139601099999999,0.34024125500000002,0.56587336899999996,1.2177907800000001]
[]
[null,null,"WFC-15","Inletflow (m^3/h)",2,8.6,15.2,21.8,28.4,35]
[null,null,null,"Max Flow [m/s]",1.48530381,6.3700384300000001,11.3304054,16.257643399999999,21.192449100000001,26.210071299999999]
[null,null,null,"VG Av Velocity 1 [m/s]",0.42202653499999998,1.5142405299999999,2.7065575000000002,3.8454685099999999,5.0376941100000003,6.1671493999999996,null,{"$f":" -0.00007*Metric!G131^2 + 0.1787*Metric!G131","v":0.52655582499999998},{"$f":" -0.00007*Inch!G131^2 + 0.1787*Inch!G131","v":0.52702309380995771},null,{"$f":" 0.0017*Metric!G131^2 + 0.0003*Metric!G131","v":1.5679249999999999E-2},{"$f":" 0.0017*Inch!G131^2 + 0.0003*Inch!G131","v":1.5706335394293211E-2},null,{"$f":" 0.0002*Metric!G131^2 + 0.7406*Metric!G131","v":2.1865105000000002},{"$f":" 0.0002*Inch!G131^2 + 0.7406*Inch!G131","v":2.1884546196467127}]
[null,null,null,"Pressure loss [Pa]",6.8106503400000001E-3,0.126498941,0.391940389,0.80719064699999998,1.3601620800000001,2.06836391]
[]
[null,null,"GFC-K60-P40J15-P10","Inletflow (m^3/h)",0.01,0.5,1,1.5,2,2.8,null,9.4]
[null,null,null,"Max Flow [m/s]",7.5133356299999995E-2,2.9627627699999999,5.9175422800000002,8.8857657099999994,11.843768300000001,16.603340599999999]
[null,null,"*Metric!G131^","VG Av Velocity 1 [m/s]",3.3822336500000001E-2,1.5608521200000001,3.12071736,4.6882967500000001,6.2730988200000004,8.7659507300000001,null,{"$f":"0.0031*Metric!G131^2 + 3.1237*Metric!G131","v":9.2418927499999999},{"$f":" 0.0031*Inch!G131^2 + 3.1237*Inch!G131","v":9.2501275581206563},null,{"$f":" 0.3962*Metric!G131^2 + 0.0083*Metric!G131","v":3.4724154999999999},{"$f":" 0.3962*Inch!G131^2 + 0.0083*Inch!G131","v":3.478566497511614},null,{"$f":"0.0055*Metric!G131^2 + 5.9136*Metric!G131","v":17.49298375},{"$f":"0.0055*Inch!G131^2 + 5.9136*Inch!G131","v":17.508567686586055}]
[null,null,"*Inch!G131^","Pressure loss [Pa]",6.6080574499999999E-5,0.102385752,0.40383795700000003,0.90365667000000005,1.60328073,3.12889354]
[]
[null,null,"GFC-K60-P40-R05","Inletflow (m^3/h)",0.3,0.6,0.9,1.2,1.6,2]
[null,null,null,"Max Flow [m/s]",1.8445412400000001,3.7003965000000001,5.5862142300000004,7.4547567299999997,9.9511476299999995,12.4491572]
[null,null,null,"VG Av Velocity 1 [m/s]",0.904232861,1.8001843099999999,2.6835065299999998,3.56880547,4.7497017599999998,5.9225481499999999,null,{"$f":" -0.0219*Metric!G131^2 + 3.0041*Metric!G131","v":8.6715102500000025},{"$f":"-0.0219*Inch!G131^2 + 3.0041*Inch!G131","v":8.6790448486605261},null,{"$f":"0.3058*Metric!G131^2 + 0.0022*Metric!G131","v":2.6677145000000002},{"$f":"0.3058*Inch!G131^2 + 0.0022*Inch!G131","v":2.6724510152404046},null,{"$f":"0.0261*Metric!G131^2 + 6.175*Metric!G131","v":18.443385250000002},{"$f":" 0.0261*Inch!G131^2 + 6.175*Inch!G131","v":18.459972968859404}]
[null,null,null,"Pressure loss [Pa]",2.7916752999999999E-2,0.110832132,0.24956789600000001,0.44330901,0.78739261500000002,1.22719841]
[]
[null,null,"GFC-K60-P40-R10","Inletflow (m^3/h)",0.5,1.8,3,4.5,6,8.5]
[null,null,null,"Max Flow [m/s]",1.03557941,3.6942926599999999,6.1282465400000001,9.2057700699999998,12.2614094,17.282758699999999]
[null,null,null,"VG Av Velocity 1 [m/s]",0.333558519,1.21374815,1.97445859,2.98640682,3.9821764900000001,5.4383646800000003,null,{"$f":" -0.0053*Metric!G131^2 + 0.6873*Metric!G131","v":1.9814117500000004},{"$f":"-0.0053*Inch!G131^2+0.6873*Inch!G131","v":1.98313109118668},null,{"$f":" 0.0192*Metric!G131^2 + 0.0036*Metric!G131","v":0.17770799999999998},{"$f":" 0.0192*Inch!G131^2 + 0.0036*Inch!G131","v":0.1780144606400911},null,{"$f":"-0.0028*Metric!G131^2 + 2.0575*Metric!G131","v":6.0452580000000005},{"$f":" -0.0028*Inch!G131^2 + 2.0575*Inch!G131","v":6.0506071496748133}]
[null,null,null,"Pressure loss [Pa]",5.2856279000000001E-3,6.6013806100000003E-2,0.18017340000000001,0.40540266200000002,0.71828317100000005,1.4153101800000001]
[]
[null,null,"GFK-K60-P40-D15","Inletflow (m^3/h)",0.25,0.5,0.75,1,1.3,1.6]
[null,null,null,"Max Flow [m/s]",1.5830770300000001,3.1685471500000002,4.7508343899999996,6.3551104599999997,8.2749548999999991,10.1998461]
[null,null,null,"VG Av Velocity 1 [m/s]",0.91332161700000003,1.8289347600000001,2.74187768,3.6599564400000002,4.7592317800000004,5.8575410300000001,null,{"$f":"0.0041*Metric!G131^2 + 3.6549*Metric!G131","v":10.81763525},{"$f":"0.0041*Inch!G131^2 + 3.6549*Inch!G131","v":10.827277741018126},null,{"$f":" 0.4711*Metric!G131^2 + 0.0075*Metric!G131","v":4.1218727500000005},{"$f":" 0.4711*Inch!G131^2 + 0.0075*Inch!G131","v":4.1291803595121515},null,{"$f":" 0.0384*Metric!G131^2 + 6.3141*Metric!G131","v":18.960771000000001},{"$f":" 0.0384*Inch!G131^2 + 6.3141*Inch!G131","v":18.977913565562044}]
[null,null,null,"Pressure loss [bar]",3.06274328E-2,0.121090869,0.270441973,0.47928169999999998,0.80637923300000003,1.21755115]
[]
[null,null,"GFK-K60-P40-D25","Inletflow (m^3/h)",0.7,2.56,4.42,6.28,8.14,10]
[null,null,null,"Max Flow [m/s]",2.0849203699999999,7.7504118999999996,13.4200588,19.103011500000001,24.802456200000002,30.452767999999999]
[null,null,"*'Metric'!G131^2","VG Av Velocity 1 [m/s]",0.45137596800000002,1.6384884799999999,2.8701287999999998,4.0905438299999997,5.3314382199999999,6.5290975400000004,null,{"$f":" 0.0009*Metric!G131^2 + 0.6453*Metric!G131","v":1.9114672500000001},{"$f":" 0.0009*Inch!G131^2 + 0.6453*Inch!G131","v":1.9131724285911071},null,{"$f":" 0.036*Metric!G131^2 + 0.0029*Metric!G131","v":0.32184499999999999},{"$f":" 0.036*Inch!G131^2 + 0.0029*Inch!G131","v":0.32240952330227562},null,{"$f":" 0.0018*Metric!G131^2 + 3.0289*Metric!G131","v":8.9509195000000012},{"$f":" 0.0018*Inch!G131^2 + 3.0289*Inch!G131","v":8.9588857373539579}]
[null,null,"*'Inch'!G131^2","Pressure loss [Pa]",1.8558525700000002E-2,0.241949464,0.71637882799999997,1.4398754600000001,2.4134875299999998,3.63096343]
[]
[null,null,"PFC-KSS-A10","Inletflow (m^3/h)",0.7,2.2000000000000002,3.7,5.0999999999999996,6.6,8]
[null,null,null,"Max Flow [m/s]",0.85954676799999996,2.7609199000000002,4.7020009700000003,6.4613201699999996,8.4147029900000003,10.3085646]
[null,null,null,"VG Av Velocity 1 [m/s]",0.50797577500000002,1.6476659199999999,2.7761077900000002,3.8384607000000002,4.9727256000000004,6.0292012899999996,null,{"$f":" 0.0008*Metric!G131^2 + 0.7474*Metric!G131","v":2.211792},{"$f":" 0.0008*Inch!G131^2 + 0.7474*Inch!G131","v":2.2137632236939035},null,{"$f":" 0.0061*Metric!G131^2 + 0.0003*Metric!G131","v":5.3970250000000004E-2},{"$f":" 0.0061*Inch!G131^2 + 0.0003*Inch!G131","v":5.4065403729527027E-2},null,{"$f":" 0.0056*Metric!G131^2 + 1.2415*Metric!G131","v":3.7111590000000003},{"$f":" 0.0056*Inch!G131^2 + 1.2415*Inch!G131","v":3.714499458137539}]
[null,null,null,"Pressure loss [Pa]",2.9973381E-3,2.9956282399999999E-2,8.4311969599999995E-2,0.159421918,0.26632637799999997,0.39064335100000003]
[]
[null,null,"PFC-23-GP-A10","Inletflow (m^3/h)",3,15,25,33,47,55]
[null,null,null,"Max Flow [m/s]",0.53243675099999999,2.7458232200000001,4.5797409299999998,6.0490082899999997,8.6036418999999995,10.0644279]
[null,null,null,"VG Av Velocity 1 [m/s]",0.30995740799999999,1.60413633,2.6652944500000002,3.5084725699999999,4.9727018000000003,5.8089090499999996,null,{"$f":" 0.1059*Metric!G131","v":0.31240499999999999},{"$f":" 0.1059*Inch!G131","v":0.31268255146418195},null,{"$f":" 0.00007*Metric!G131^2 + 0.00003*Metric!G131","v":6.9767500000000003E-4},{"$f":" 0.00007*Inch!G131^2 + 0.00003*Inch!G131","v":6.9883653181037058E-4},null,{"$f":" 0.1831*Metric!G131","v":0.5401450000000001},{"$f":" 0.1831*Inch!G131","v":0.54062488359859984}]
[null,null,null,"Pressure loss [Pa]",6.9873444299999997E-4,1.63557719E-2,4.5001075500000001E-2,7.8071929799999995E-2,0.157719412,0.215624864]
[]
[null,null,"PFC-23-GP-A15","Inletflow (m^3/h)",3,13.5,24,34.5,46,55]
[null,null,null,"Max Flow [m/s]",0.55044623199999998,2.5311945599999999,4.5137030200000003,6.5205723500000001,8.7420679200000002,10.479881199999999]
[null,null,null,"VG Av Velocity 1 [m/s]",0.319165266,1.50480291,2.6627073299999999,3.81670781,5.0795836100000002,6.0552493299999997,null,{"$f":" 0.1104*Metric!G131","v":0.32568000000000003},{"$f":" 0.1104*Inch!G131","v":0.32596934543574779},null,{"$f":" 0.00007*Metric!G131^2 + 0.00007*Metric!G131","v":8.1567499999999997E-4},{"$f":" 0.00007*Inch!G131^2 + 0.00007*Inch!G131","v":8.169413671131777E-4},null,{"$f":" 0.00008*Metric!G131^2 + 0.1863*Metric!G131","v":0.55028120000000003},{"$f":" 0.00008*Inch!G131^2 + 0.1863*Inch!G131","v":0.55077070802891959}]
[null,null,null,"Pressure loss [Pa]",7.6379019800000005E-4,1.4234047200000001E-2,4.4058124800000001E-2,9.0261718800000001E-2,0.15969792299999999,0.226908796]
[]
[null,null,"PR-23-W2","Inletflow (m^3/h)",3,9.4,15.8,22.2,28.6,35]
[null,null,null,"Max Flow [m/s]",1.2607605200000001,3.9449665700000001,6.6043938200000003,9.3356739399999995,12.047190199999999,14.7565755]
[null,null,null,"VG Av Velocity 1 [m/s]",4.0114203600000002E-2,0.11730328399999999,0.26933642600000002,0.39429499800000001,0.52638974699999996,0.65248865899999997,null,{"$f":" 0.0001*Metric!G1312 + 0.0144*Metric!G131","v":4.2480000000000004E-2},{"$f":"0.0001*Inch!G1312 + 0.0144*Inch!G131","v":4.2517740709010578E-2},null,{"$f":"0.0003*Metric!G1312 + 0.0002*Metric!G131","v":5.9000000000000003E-4},{"$f":"0.0003*Inch!G1312 + 0.0002*Inch!G131","v":5.9052417651403585E-4},null,{"$f":"0.0001*Metric!G1312 + 0.4175*Metric!G131","v":1.231625},{"$f":"0.0001*Inch!G1312 + 0.4175*Inch!G131","v":1.2327192184730498}]
[null,null,null,"Pressure loss [Bar]",2.60591932E-3,2.4465416199999999E-2,6.8013030399999994E-2,0.13257561000000001,0.218295985,0.32580329800000002]
[]
[null,null,"PR-23-W3","Inletflow (m^3/h)",5,21,37,53,69,85]
[null,null,null,"Max Flow [m/s]",1.1389708700000001,4.8753282699999998,8.6256564999999998,12.3784446,16.1415592,19.865711099999999]
[null,null,null,"VG Av Velocity 1 [m/s]",2.1402568E-2,0.121468151,0.24613275400000001,0.51223595200000005,0.68957393300000003,0.80847843799999997,null,{"$f":" 0.00004*Metric!G1312 + 0.0065*Metric!G131","v":1.9175000000000001E-2},{"$f":" 0.00004*Inch!G1312 + 0.0065*Inch!G131","v":1.9192035736706164E-2},null,{"$f":" 0.0001*Metric!G1312 + 0.0002*Metric!G131","v":5.9000000000000003E-4},{"$f":" 0.0001*Inch!G1312 + 0.0002*Inch!G131","v":5.9052417651403585E-4},null,{"$f":" 0.00001*Metric!G1312 + 0.2326*Metric!G131","v":0.68617000000000006},{"$f":" 0.00001*Inch!G1312 + 0.2326*Inch!G131","v":0.68677961728582371}]
[null,null,null,"Pressure loss [Bar]",3.70155652E-3,6.4356205299999997E-2,0.19767235399999999,0.40021486699999997,0.675741064,1.01541568]
[]
[null,null,"PR-23-W4","Inletflow (m^3/h)",10,38,66,94,122,150]
[null,null,null,"Max Flow [m/s]",1.17137826,4.4539424199999997,7.7277513999999998,10.9829712,14.264055300000001,17.516077599999999]
[null,null,null,"VG Av Velocity 1 [m/s]",2.4393945399999999E-2,0.12200349100000001,0.224942999,0.32426263500000002,0.43450008699999998,0.48884684699999997,null,{"$f":" 0.0034*Metric!G131","v":1.0030000000000001E-2},{"$f":" 0.0034*Inch!G131","v":1.0038911000738608E-2},null,{"$f":" 0.00002*Metric!G1312 + 0.00003*Metric!G131","v":8.850000000000001E-5},{"$f":" 0.00002*Inch!G1312 + 0.00003*Inch!G131","v":8.8578626477105372E-5},null,{"$f":" 0.1169*Metric!G131","v":0.34485500000000002},{"$f":" 0.1169*Inch!G131","v":0.34516138117245398}]
[null,null,null,"Pressure loss [Bar]",1.7766603000000001E-3,2.4862649000000001E-2,7.4049692599999994E-2,0.149097492,0.24996740000000001,0.37628932799999998]
[]
[null,null,"FTC-05","Inletflow (m^3/h)",1,3.8,6.6,9.4,12.2,15]
[null,null,null,"Max Flow [m/s]",0.66094378899999995,2.5092913100000001,4.35963031,6.2120818,8.0579635500000002,9.9273433999999998]
[null,null,null,"Prism velocity [m/s]",0.39583438999999998,1.4985679300000001,2.5911176899999999,3.7065453900000001,4.7980058999999997,5.8876281800000001,null,{"$f":" -0.0001*Metric!G1312 + 0.3949*Metric!G131","v":1.164955},{"$f":" -0.0001*Inch!G1312 + 0.3949*Inch!G131","v":1.1659899865269636},null,{"$f":"0.0009*Metric!G1312 + 0.0003*Metric!G131","v":8.8499999999999994E-4},{"$f":"0.0009*Inch!G1312 + 0.0003*Inch!G131","v":8.8578626477105367E-4},null,{"$f":"0.0001*Metric!G1312 + 0.6593*Metric!G131","v":1.9449350000000001},{"$f":"0.0001*Inch!G1312 + 0.6593*Inch!G131","v":1.9466629478785191}]
[null,null,null,"Pressure loss [Bar]",9.8493959000000002E-4,1.3478223500000001E-2,3.9703916200000001E-2,7.8932568499999994E-2,0.13220770400000001,0.19848173199999999]
[]
[null,null,"FTC-A10","Inletflow (m^3/h)",1,3.8,6.6,9.4,12.2,15]
[null,null,null,"Max Flow [m/s]",0.763000283,2.88145249,5.0064275599999997,7.1245339200000002,9.2478140799999995,11.3657123]
[null,null,null,"Prism velocity [m/s]",0.39187043500000002,1.5325243500000001,2.6626342799999998,3.79014461,4.9191999400000004,6.04224345,null,{"$f":"-0.00004*Metric!G1312 + 0.4035*Metric!G131","v":1.1903250000000001},{"$f":"-0.00004*Inch!G1312 + 0.4035*Inch!G131","v":1.1913825261170674},null,{"$f":"0.0011*Metric!G1312 + 0.0007*Metric!G131","v":2.065E-3},{"$f":" 0.0011*Inch!G1312 + 0.0007*Inch!G131","v":2.0668346177991253E-3},null,{"$f":" -0.00008*Metric!G1312 + 0.7589*Metric!G131","v":2.2387550000000003},{"$f":" -0.00008*Inch!G1312 + 0.7589*Inch!G131","v":2.2407439877825088}]
[null,null,null,"Pressure loss [Bar]",1.40989066E-3,1.8174093700000001E-2,5.3030210899999999E-2,0.105424877,0.174861719,0.26142304100000002]
[]
[null,null,"FTC-A15","Inletflow (m^3/h)",3,5,14,23,32,41]
[null,null,null,"Max Flow [m/s]",0.84452994999999997,1.40684582,3.94584943,6.4750118499999996,8.9912667600000002,11.504529]
[null,null,null,"Prism velocity [m/s]",0.48087239999999998,0.80035432399999995,2.24955237,3.6982901300000002,5.1498593799999997,6.5537974400000003,null,{"$f":"-0.00004*Metric!G1312 + 0.1618*Metric!G131","v":0.47731000000000001},{"$f":"-0.00004*Inch!G1312 + 0.1618*Inch!G131","v":0.47773405879985498},null,{"$f":" 0.0001*Metric!G1312 + 0.0001*Metric!G131","v":2.9500000000000001E-4},{"$f":" 0.0001*Inch!G1312 + 0.0001*Inch!G131","v":2.9526208825701792E-4},null,{"$f":" -0.00004*Metric!G1312 + 0.2824*Metric!G131","v":0.83308000000000004},{"$f":" -0.00004*Inch!G1312 + 0.2824*Inch!G131","v":0.83382013723781856}]
[null,null,null,"Pressure loss [Bar]",1.06579865E-3,2.8732653800000001E-3,2.16677407E-2,5.7453854499999998E-2,0.109566238,0.17870733699999999]
[]
[null,null,"FTC-A20","Inletflow (m^3/h)",6,18.8,31.6,44.4,57.2,70]
[null,null,null,"Max Flow [m/s]",0.94049347100000003,2.9433324500000002,4.9431885400000004,6.9287704300000001,8.9051559099999995,10.870236]
[null,null,null,"Prism velocity [m/s]",0.54227831900000001,1.70831095,2.8743179300000001,4.0254963100000003,5.1764783100000002,6.3119822299999999,null,{"$f":"-0.00002*Metric!G1312 + 0.0914*Metric!G131","v":0.26962999999999998},{"$f":"-0.00002*Inch!G1312 + 0.0914*Inch!G131","v":0.26986954866691437},null,{"$f":" 0.00002*Metric!G1312 + 0.00006*Metric!G131","v":1.7700000000000002E-4},{"$f":" 0.00002*Inch!G1312 + 0.00006*Inch!G131","v":1.7715725295421074E-4},null,{"$f":" -0.00003*Metric!G1312 + 0.1573*Metric!G131","v":0.46403500000000003},{"$f":" -0.00003*Inch!G1312 + 0.1573*Inch!G131","v":0.46444726482828919}]
[null,null,null,"Pressure loss [Bar]",7.2591722400000005E-4,6.6514127200000004E-3,1.8210797500000001E-2,3.5082102499999997E-2,5.7147892999999998E-2,8.4342565300000005E-2]
[]
[null,null,"CFC-M10","Inletflow (m^3/h)",0.8,3.44,6.08,8.7200000000000006,11.36,14]
[null,null,null,"Max Flow [m/s]",0.50380894499999995,2.08430698,3.6830728100000001,5.2762534099999998,6.86447918,8.5106080300000002]
[null,null,null,"Prism velocity [m/s]",0.36676209300000001,1.57919023,2.8046558300000002,4.0412860999999998,5.2336550700000002,6.4139441599999998,null,{"$f":"-0.0005*Metric!G1312 + 0.4656*Metric!G131","v":1.3735200000000001},{"$f":"-0.0005*Inch!G1312 + 0.4656*Inch!G131","v":1.3747402829246755},null,{"$f":" 0.0004*Metric!G131^2 + 0.0003*Metric!G131","v":4.3660000000000001E-3},{"$f":" 0.0004*Inch!G131^2 + 0.0003*Inch!G131","v":4.3729742952468556E-3},null,{"$f":" 0.0003*Metric!G1312 + 0.603*Metric!G131","v":1.77885},{"$f":" 0.0003*Inch!G1312 + 0.603*Inch!G131","v":1.7804303921898179}]
[null,null,null,"Pressure loss [Bar]",4.10835317E-4,5.9688558600000004E-3,1.7818428399999999E-2,3.5697350199999998E-2,5.8715028400000001E-2,8.8209939299999998E-2]
[]
[null,null,"CFC-M20","Inletflow (m^3/h)",2,9.6,17.2,24.8,32.4,40]
[null,null,null,"Max Flow [m/s]",0.37224214300000003,1.7960700599999999,3.2316422299999998,4.6577023500000001,6.0839762500000001,7.4981974100000004]
[null,null,null,"Prism velocity [m/s]",0.238964601,1.47005531,2.68937684,3.8948828299999998,5.1009234599999997,6.3113137899999998,null,{"$f":"0.0001*Metric!G1312 + 0.154*Metric!G131","v":0.45430000000000004},{"$f":"0.0001*Inch!G1312 + 0.154*Inch!G131","v":0.4547036159158076},null,{"$f":" 0.00003*Metric!G1312 + 0.00005*Metric!G131","v":1.4750000000000001E-4},{"$f":" 0.00003*Inch!G1312 + 0.00005*Inch!G131","v":1.4763104412850896E-4},null,{"$f":" -0.00001*Metric!G1312 + 0.188*Metric!G131","v":0.55459999999999998},{"$f":" -0.00001*Inch!G1312 + 0.188*Inch!G131","v":0.5550927259231937}]
[null,null,"*'Metric'!G131^2","Pressure loss [Bar]",1.80019633E-4,3.3239385500000002E-3,1.04176166E-2,2.1065815200000001E-2,3.5438290099999999E-2,5.3579932099999998E-2]
[null,null,"*'Inch'!G131^2"]
[]
[]
[]
[]
[]
[]
[]
[]
[]
[]
[null,null,null,"Inletflow (m/s)",0.4,0.75,1.5,3,4.5,6]
[null,null,null,"Max Flow [m/s]"]
[null,null,null,"VG Av Velocity 1 [m/s]"]
[null,null,null,"Pressure loss [Pa]"]
[null,null,null,"Shear Stress Average [Pa]"]
[]
[]
[]
[null,"SG CAD Area 1 [m^2]",null,0,{"$f":"SQRT(0.0000282743338823081/PI())","v":2.9999999999999979E-3},2.82743338823081E-5,2.82743338823081E-5,2.82743338823081E-5,2.82743338823081E-5,2.82743338823081E-5]

{"sheet":"CustomerSheetBeta","index":3,"n_rows":20,"n_cols":12,"rows_kept":20,"cut":false,"hidden":true,"merged":[[12,1,13,4],[1,1,2,5],[7,8,7,10],[8,8,8,10],[9,8,9,10],[10,8,10,10]]}
[]
[null,"Customer Sheet"]
[]
[]
[]
[]
[]
[null,"Name",null,null,null,null,null,null,"qeqe"]
[null,"Address",null,null,null,null,null,null,"qweqe"]
[null,"Installation point",null,null,null,null,null,null,"qweqe"]
[null,"Process medium",null,null,null,null,null,null,"qweqe"]
[]
[null,"Selected Cell"]
[]
[]
[null,"Name",null,null,null,null,null,"PFC-KSS-A10"]
[null,"Pipe Size",null,null,null,null,null,1,null,null,null,"in"]
[null,"Inlet Diameter",null,null,null,null,null,1.0606299212598427,null,null,null,"in"]
[null,"Pressure drop",null,null,null,null,null,0.26375479255540141,null,null,null,"psi"]
[null,"Flow on prism",null,null,null,null,null,1.4,null,null,null,"ft/s"]